Usr bin dpkg error

usr bin dpkg error

Shell/Bash answers related to “error E: Sub-process /usr/bin/dpkg returned an error code (1)” · E: Unable to fetch some archives, maybe run apt-get update or try. Packages are misconfigured or were not properly installed. Resolution. Warning: Manipulations with the package manager can lead to system. The “sub-process /usr/bin/dpkg returned an error code (1)” indicates that there is a problem with the package installer, which is generally.

Usr bin dpkg error - agree with

“error E: Sub-process /usr/bin/dpkg returned an error code (1)” Code Answer’s

Grepper Logo



E: Sub-process /usr/bin/dpkg returned an error code (1)

shell by Azizul7mAzizul7m        on Apr 27 2021 Comment

Answers related to “error E: Sub-process /usr/bin/dpkg returned an error code (1)”


Queries related to “error E: Sub-process /usr/bin/dpkg returned an error code (1)”





More “Kinda” Related Answers View All Shell/Bash Answers »

  • [ERROR] Error while getting Capacitor CLI version. Is Capacitor installed?
  • error gyp ERR! stack Error: not found: make
  • gyp ERR! stack Error: not found: make
  • install lxml
  • bs4.FeatureNotFound: Couldn't find a tree builder with the features you requested: lxml. Do you need to install a parser library?
  • Ubuntu fix broken package
  • android gradle signing report
  • E: dpkg was interrupted, you must manually run 'sudo dpkg --configure -a' to correct the problem
  • e package 'oracle-java8-installer' has no installation candidate ubuntu 16.04
  • subprocess.CalledProcessError: Command '('lsb_release', '-a')' returned non-zero exit status 1.
  • cannot find lock /var/lib/dpkg/lock-frontend
  • CocoaPods specs repository is too out-of-date to satisfy dependencies.
  • npm WARN deprecated [email protected]: Please upgrade to version 7 or higher.
  • Install for [ '[email protected]' ] failed with code 1
  • npm ERR! Maximum call stack size exceeded ubuntu
  • error pip install psycopg2-binary ld: library not found for -lssl
  • errors were encountered while processing: mysql-server-5.7 mysql-server e: sub-process /usr/bin/dpkg returned an error code (1)
  • Failed to install the app. Make sure you have the Android development environment set up
  • NotImplementedError: OpenSSH keys only supported if ED25519 is available net-ssh requires the following gems for ed25519 suppor
  • Unable to acquire the dpkg frontend lock (/var/lib/dpkg/lock-frontend), is another process using it?
  • fix failed to fetch in apt-get update
  • command failed: npm install --loglevel error --legacy-peer-deps
  • git cannot spawn gpg no such file or directory
  • Skipping acquire of configured file 'main/binary-i386/Packages' as repository 'https://apt.repos.neuron.amazonaws.com bionic InRelease' doesn't support architecture 'i386'
  • E: Unable to fetch some archives, maybe run apt-get update or try with --fix-missing?
  • Error running '__rvm_make -j1'
  • Unable to correct problems, you have held broken packages
  • chrome skia shader compilation error
  • flutter skia shader compilation error
  • flutter errors shader compilation error
  • E: The repository 'http://ppa.launchpad.net/kirillshkrogalev/ffmpeg-next/ubuntu focal Release' does not have a Release file.
  • sudo apt update error E: The repository 'http://ppa.launchpad.net/kirillshkrogalev/ffmpeg-next/ubuntu focal Release' does not have a Release file.
  • failed to download metadata for repo 'appstream' centos 7
  • Error: Failed to download metadata for repo 'appstream': Cannot prepare internal mirrorlist: No URLs in mirrorlist
  • apt ignore certificate
  • sudo apt update ignore gpg signature
  • No matching distribution found for PyJWT==2.0.1
  • rrors were encountered while processing: /var/cache/apt/archives/libpython3.10-stdlib_3.10.4-1+focal2_amd64.deb
  • husky > pre-commit hook failed (add --no-verify to bypass)
  • Error: GPG check FAILED fedora mysql
  • E: Could not get lock /var/lib/dpkg/lock-frontend - open (11: Resource temporarily unavailable) E: Unable to acquire the dpkg frontend lock (/var/lib/dpkg/lock-frontend), is another process using it?
  • invalid or corrupted database (pgp signature)
  • Sub-process /usr/bin/dpkg returned an error code
  • UserWarning: Matplotlib is currently using agg, which is a non-GUI backend, so cannot show the figure. plt.show()
  • interface graphique sur python
  • unable to correct problems you have held broken packages npm
  • react native Could not find "Podfile.lock" at
  • cannot update snap namespace: cannot create symlink in "/etc/docker": existing file in the way snap-update-ns failed with code 1
  • you must sign up for private packages
  • A template was not provided. This is likely because you're using an outdated version of create-react-app. Please note that global installs of create-react-app are no longer supported.
  • npx --ignore-existing
  • Kali linux Unable to acquire the dpkg frontend lock (/var/lib/dpkg/lock-frontend), are you root? virtualbox
  • Timeout waiting to lock daemon addresses registry. It is currently in use by another Gradle instance.
  • install php8
  • brew Failure while executing; `/bin/launchctl bootstrap gui/501 /Users/webhasan/Library/LaunchAgents/homebrew.mxcl.httpd.plist` exited with 5.
  • gumlet/php-image-resize 1.9.2 requires ext-gd *
  • yum doesn't have enough cached data to continue
  • package 'git' has no installation candidate
  • Fatal error in launcher:
  • GVfs metadata is not supported. Fallback to Tell Metadata Manager. Either GVfs is not correctly installed or GVfs metadata are not supported on this platform. In the latter case, you should configure Tepl with --disable-gvfs-metadata.
  • Permissions 0664 for '/home/kapua/keys/dev11' are too open.
  • private key is too open
  • Permissions 0644 for are too open. It is required that your private key files are NOT accessible by others. This private key will be ignored
  • Could not open lock file /var/lib/dpkg/lock-frontend - open (13: Permission denied)
  • bash errors: syntax error - ambiguous - file
  • pkg-config: not found
  • apt NO_PUBKEY 23E7166788B63E1E
  • fatal: unknown date format format-local:%f %t ./bin/gbuild:167:in `block (2 levels) in build_one_configuration': error looking up author date in antimony (runtimeerror)
  • WSL2 trying to launch VSCode with code . results in error "Please install missing certificates."
  • Writing login information to the keychain failed with error 'GDBus.Error:org.freedesktop.DBus.Error.ServiceUnknown: The name org.freedesktop.secrets was not provided by any .service files'.
  • Couldn't check the working tree for unmerged files because of an error. bad signature 0x00000000 index file corrupt
  • ArgumentError: Malformed version number string 0.32+git
  • gpg: invalid key resource URL '/tmp/apt-key-gpghome.gii4qKyR0T/home:manuelschneid3r.asc.gpg'
  • how to fix Unable to correct problems, you have held broken packages npm ubuntu
  • error Failed to install the app. Make sure you have the Android development environment set up
  • dpkg: error processing package gitweb (--configure): installed gitweb package post-instal
  • fail2ban apt
  • error: ‘thread’ is not a member of std
  • Gradle build failed to produce an .apk file. It's likely that this file was generated under but the tool couldn't find it.
  • elifecycle npm install error
  • error Invalid plugin options for "gatsby-plugin-manifest":
  • fatal unable to create '.git/index.lock' file exists
  • You can fix that by adding this to your shell's config file (.bashrc, .bash_profile, etc.): export PATH="$PATH":"$HOME/Developer/flutter/.pub-cache/bin"
  • Pub installs executables into $HOME/.pub-cache/bin, which is not on your path.
  • how to fix could not fix var lock /var/lib/dpkg/lock ubuntu
  • E: Could not get lock /var/lib/dpkg/lock-frontend - open (11: Resource temporarily unavailable)
  • Failure while executing; `/bin/launchctl bootstrap gui/501 /Users/singh/Library/LaunchAgents/homebrew.mxcl.httpd.plist` exited with 5. [email protected] ~ % sudo apachectl start
  • phpcs: Request workspace/configuration failed with message: Unable to locate phpcs. Please add phpcs to your global path or use composer dependency manager to install it in your project locally.
  • Error: CocoaPods's specs repository is too out-of-date to satisfy dependencies.
  • solving environment failed with initial frozen solve
  • Fix the upstream dependency conflict, or retry this command with --force, or --legacy-peer-deps to accept an incorrect (and potentially broken) dependency resolution.
  • E: Sub-process /usr/bin/dpkg returned an error code (1)
  • Install for [ '[email protected]' ] failed with code 7
  • Error: The following directories are not writable by your user: /usr/local/lib/pkgconfig
  • E: Unable to locate package mongodb-org
  • snap-update-ns failed with code 1
  • bloquear /var/lib/apt/lists
  • BUILD FAILED (Ubuntu 20.04 using python-build 20180424)
  • E: Sub-process dpkg --set-selections returned an error code (2) E: Couldn't clean the currently selected dpkg states
  • ineffective mark-compacts near heap limit allocation failed - javascript heap out of memory angular
  • Expected linebreaks to be 'LF' but found 'CRLF'
  • npm WARN deprecated [email protected]: This version of tar is no longer supported, and will not receive security updates. Please upgrade asap.
  • Unable to create directory wp-content/uploads/. Is its parent directory writable by the server?
  • linux Could not find a version that satisfies the requirement
  • ERROR: Could not find a version that satisfies the requirement flask (from versions: none) ERROR: No matching distribution found for flask
  • dpkg: error processing archive /var/cache/apt/archives/atftpd_0.7.git20210915-
  • Errors were encountered while processing: libglx-mesa0:amd64
  • An error occurred while running subprocess capacitor.
  • E: Unmet dependencies. Try 'apt --fix-broken install' with no packages (or specify a solution).
  • E: Unable to acquire the dpkg frontend lock (/var/lib/dpkg/lock-frontend), is another process using it?
  • psycopg2-binary install for M1
  • E: Package 'php5-fpm' has no installation candidate
  • error failed to commit transaction (failed to retrieve some files)
  • ERROR: Could not build wheels for backports.zoneinfo, which is required to install pyproject.toml-based projects
  • installed libc-bin package post-installation script subprocess returned error exit status 134
  • A snapshot operation for 'Pixel_4_API_30' is pending and timeout has expired. Exiting...
  • install php-fpm
  • Unable to acquire the dpkg frontend lock (/var/lib/dpkg/lock-frontend), are you root?
  • dpkg frontend lock
  • var lock
  • E: Unable to acquire the dpkg frontend lock (/var/lib/dpkg/lock-frontend), are you root?
  • 76 packages are looking for funding run `npm fund` for details found 7 vulnerabilities (5 low, 1 moderate, 1 high) run `npm audit fix` to fix them, or `npm audit` for details
  • The repository 'http://deb.debian.org/debian buster-updates InRelease' is not signed
  • apt lock
  • Package 'php-imagick' has no installation candidate
  • libc-bin error
  • ubuntu errors were encountered while processing libc-bin
  • Failed to install the following Android SDK packages as some licences have not been accepted.
  • Failed to build iOS project. We ran "xcodebuild" command but it exited with error code 65.
  • migrate has no installation candidate
  • configuration file is group-readable. This is insecure linux
  • gem pg install error mac os
  • tasksel: apt-get failed (100)
  • ERROR: There are no scenarios; must have at least one.
  • buster InRelease' changed its 'Suite' value from 'stable' to 'oldstable'
  • su: failed to execute /bin/bash: Resource temporarily unavailable
  • dpkg-buildpackage: error: fakeroot debian/rules clean subprocess returned exit status 2
  • sudo apt-get ignore warning
  • sudo apt-get ignore errors
  • 'image's platform (linux/amd64) does not match the detected host platform (linux/arm64/v8)
  • FATAL ERROR: Ineffective mark-compacts near heap limit Allocation failed - JavaScript heap out of memory
  • unable to import wx
  • Target Packages (main/binary-amd64/Packages) is configured multiple times in /etc/apt/sources.list.d/pgdg.list:1 and /etc/apt/sources.list.d/pgdg.list:2
  • jitsi run pod ios app !] Invalid `Podfile` file: cannot load such fil
  • apt-key deprecated
  • [INS-30131] Initial setup required for the execution of installer validations failed.
  • The engine "yarn" is incompatible with this module. Expected version "^v1.22.17". Got "1.22.10"
  • error: gpg failed to sign the data fatal: failed to write commit object
  • ETIMEDOUT Error while installing Node packages on Windows
  • Unable to boot device due to insufficient system resources.
  • module 'platform' has no attribute 'linux_distribution'
  • Reading state information... Done E: Unable to locate package docker-ce
  • Cannot find cairo.h! Please install cairo
  • Fatal error in launcher: Unable to create process using getting this error while installing pip
  • the repository 'http://us.archive.ubuntu.com/ubuntu groovy release' no longer has a release file.
  • Error: Unable to find a match: ansible
  • Errors during downloading metadata for repository
  • Package signatures do not match previously installed version; ignoring!
  • Error: CocoaPods's specs repository is too out-of-date to satisfy dependencies. To update the CocoaPods specs, run: pod repo update
  • You are using a 64-bit WINEPREFIX. Note that many verbs only install 32-bit versions of packages. If you encounter problems, please retest in a clean 32-bit WINEPREFIX
  • remote: fatal: pack exceeds maximum allowed size
  • Column count of mysql.proc is wrong. Expected 20, found 16. The table is probably corrupted
  • error: <class 'xmlrpclib.Fault'>, <Fault 6: 'SHUTDOWN_STATE'>: file: /usr/lib/python2.7/xmlrpclib.py line: 800
  • QSslSocket: cannot resolve CRYPTO_set_id_callback QSslSocket: cannot resolve CRYPTO_set_locking_callback QSslSocket: cannot resolve sk_free QSslSocket
  • E: Package 'gcc-4.9' has no installation candidate
  • ubuntu 14 Some index files failed to download. They have been ignored, or old ones used instead.
  • A problem Could not read script 'plugins/dynatrace-cordova-plugin/files/plugin.gradle' as it does not exist.
  • big sur ERROR: Error installing ffi: ERROR: Failed to build gem native extension.
  • Could not extract RVM sources
  • requirements check failed for jdk 8 ('1.8.*')! detected version: 15.0.1
  • Skipping acquire of configured file 'multiverse/binary-1386/Packages' as repository 'http://archive.ubuntu.com/ubuntu focal-security InRelease' doesn't support architecture '1386'
  • The CUDA compiler identification is unknown CMake Error at CMakeLists.txt:441 (enable_language): No CMAKE_CUDA_COMPILER could be found.
  • gen_random_uuid() does not exist
  • gen_random_uuid pgsql
  • No such keg: /usr/local/Cellar/git
  • Could not execute 'apt-key' to verify signature (is gnupg installed?)
  • verbose stack Error: [email protected] install: `node-pre-gyp install --fallback-to-build`
  • figma-linux: /opt/figma-linux/libm.so.6: version `GLIBC_2.35' not found (required by /usr/lib/libcairo.so.2)
  • Error: Unable to find a match: centos-release-openstack-queens
  • warning: LF will be replaced by CRLF in [file_path]
  • Got socket error trying to find package cupertino_icons at https://pub.dartlang.org.
  • xrandr configure crtc 2 failed ubuntu
  • package 'ffmpeg' has no installation candidate ubuntu 18.04
  • flutter pub get taking too long
  • Could not find or parse valid build output file.
  • ERROR: No matching distribution found for torch.fx
  • how to realse the lock in the linux in apt
  • Command "python setup.py egg_info" failed with error code 1 in /tmp/pip-build-idlotqqi/cryptography/
  • unexpected inconsistency run fsck manually
  • open /var/lib/docker/tmp/buildkit-mount140273675/Dockerfile.base: no such file or directory
  • The file \AppData\Roaming\npm\yarn.ps1 is not digitally signed.
  • treating warnings as errors because process.env.ci = true. github
  • dnf failed to download metadata for repo 'appstream'
  • centos 8.1 Error: Failed to download metadata for repo 'AppStream'
  • android/gradlew EACCES error
  • chmod
  • W: GPG error: http://packages.ros.org/ros/ubuntu xenial InRelease: The following signatures were invalid: KEYEXPIRED 1622248854
  • apt source "--ignore-missing"
  • linux apt ignore not found package
  • /bin/grep: /sbin/init: No such file or directory
  • how-to-fix-held-broken-packages
  • Malformed entry 2 in list file /etc/apt/sources.list.d/docker.list ([option] not assignment)
  • ERROR: Failed building wheel for kiwisolver
  • PrestaShop installation needs to write critical files in the folder var/cache
  • Failed to build logging Installing collected packages: logging Running setup.py install for logging ... error
  • fatal: unable to create thread: fatal: fetch-pack: invalid index-pack output
  • git error: bad pack header
  • Error: Failed to download metadata for repo 'rhel-8-for-x86_64-appstream-rpms': Cannot download repomd.xml: Cannot download repodata/repomd.xml: All mirrors were tried
  • /usr/include/gnu/stubs.h:7:11: fatal error: gnu/stubs-32.h: No such file or directory
  • failed to execute child process gnome-software no such file
  • Problem 1: problem with installed package podman-docker-2.2.1-7.module_el8.3.0+699+d61d9c41.noarch
  • dpkg: error processing package libc-bin (--configure): installed libc-bin package post-installation script subprocess returned error exit status 134
  • invalid signature for kali linux repositories
  • How to solve bad signature... index file corrupt
  • CMake: unsupported GNU version -- gcc versions later than 8 are not supported
  • Execution failed for task ':app:validateSigningDebug'. > Keystore file '/Users/apple/Documents/GitHub/tfbrandnew/android/app/debug.keystore' not found for signing config 'debug'.
  • Failed to install expo package with error: yarnpkg exited with non-zero code: 1 yarnpkg exited with non-zero code: 1
  • Unable to locate package python3-certbot-nginx
  • java.util.concurrent.ExecutionException: com.android.builder.testing.api.DeviceException: com.android.ddmlib.InstallException: INSTALL_FAILED_VERSION_DOWNGRADE: Package Verification Result
  • E: Could not open lock file /var/lib/dpkg/lock-frontend - open (13: Permission denied)
  • Unable to correct problems, you have held broken packages installing cuda
  • wrong fs type, bad option, bad superblock on /dev/loop0, missing codepage or helper program, or other error+dd image
  • Cannot validate since a PHP installation could not be found. Use the setting 'php.validate.executablePath' to configure the PHP executable. mac
  • why upgrade ubuntu then frequently shows this message "It iwating for cache lock: Could not get lock /var/lib/dpkg/lock.frontend.
  • syslog-ng[31899]: error processing log message: <111> splunk format
  • pkg_resources.DistributionNotFound:
  • splunk error can not create trial
  • Unknown lifecycle phase ".surefire.debug".
  • kipping acquire of configured file
  • +dh_dwz returned exit code 1
  • Warning: Pub installs executables into $HOME/.pub-cache/
  • failed. CAfile: none CRLfile: none
  • Anaconda Navigator throws exception "AttributeError: 'bytes' object has no attribute 'copy'"
  • Failed to start LSB: VirtualBox Linux kernel module.
  • how to install broken pakage in apt
  • The ultimate RAM upgrade for your brain, easily snag and access code answers. Accrue code answers to common coding problems, fin
  • Execution failed for task ':app:compressDebugAssets'.
  • watchman fatal error: openssl/sha.h: No such file or directory
  • Because you can never quite anticipate in which environment your particular zsh will be launched in, it is good practice to reset the options at the beginning of your script with the emulate command:
  • GPG error: https://packages.sury.org/php buster InRelease:
  • e: unable to locate package python-openssl zsh
  • error: failed to init transaction
  • McFly: Upgrading McFly DB to version 3, please wait...thread 'main' panicked at 'McFly error: Unable to add cmd_tpl to commands (duplicate column name: cmd_tpl)', src/history/schema.rs:41:17
  • fix EACCEC
  • yarn add v1.9.4 warning ../../package.json: No license field error Missing list of packages to add to your project.
  • E: No se pudo abrir el fichero de bloqueo «/var/cache/apt/archives/lock»
  • Ubuntu Waiting for cache lock: Could not get lock /var/lib/dpkg/lock-frontend. It is held by process 15551 (apt)
  • regex log level info or warn or erro
  • Package 'gunicorn3' has no installation candidate
  • if you're trying to use a package make sure that 'react-icons/bi/index' is installed. if you're trying to use a local file make sure that the path is correct.
  • manjaro error: could not lock database: File exists
  • output format is WPS Path to intermediate files is ./ ERROR: edition_num: unable to open GRIBFILE.AAA
  • Error: Error: rpmdb open failed
  • nodejs new version error overwrite old
  • The following software packages from the apt repositories are required to get Cuckoo to install and run properly:
  • pE: dpkg was interrupted, you must manually run 'sudo dpkg --configure -a' to correct the problem.
  • how to fix expired key when apt update
  • How do I fix issue "E: some index files fail to download.They have been ignored or old ones are used instead" while apt-get update
  • ssh_askpass: posix_spawnp: Unknown error
  • the demonstration data of 2 module(s) failed to install and were disabled
  • override dh_dwz
  • ode ELIFECYCLE npm ERR! errno 1 npm ERR! [email protected] postinstall: `node scripts/build.js` npm ERR! Exit status 1 npm ERR! npm ERR! Failed at the [email protected] postinstall script. npm ERR! This is probably not a problem with npm. There is likely add
  • adb install_failed_already_exists
  • Failed to install the app. Make sure you have the Android development environment set up: https://reactnative.dev/docs/environment-setup.
  • fatal: [node1]: FAILED! => {"attempts": 4, "changed": false, "msg": "No package matching 'python-apt' is available"}
  • bitbucket invalid slug
  • kylekatarnls/update-helper does not exist and could not be created
  • There are not enough slots available in the system to satisfy the 5 slots that were requested by the application
  • node-pre-gyp ERR! install response status 404 Not Found
  • archlinux Unable to install Yay, Paru and Endeavouros Keyring
  • digital ocean how to install joomla 16.04
  • Problem with MergeList /var/lib/apt/lists/developer.download.nvidia.com_compute_cuda_repos_ubuntu2204_x86%5f64_Packages
  • ubuntu error dpkg: error processing archive libc6_2.27-3ubuntu1_amd64.deb (--install): new libc6:amd64 package pre-installation script subprocess returned error exit status 1 Processing triggers for libc-bin (2.27-3ubuntu1.2) ...
  • fix errors occurred during update in linux
  • apt update Release is not signed
  • dpkg: dependency problems prevent configuration of zoom:
  • dpkg: error processing archive /var/cache/apt/archives/influxdb_1.8.10-1_amd64.deb (--unpack):
  • Warning : no large blobs matching criteria found in packfiles - does the repo need to be packed?
  • <bits/types/__fpos_t.h> no such file or directory
  • dependency problems - leaving unconfigured Errors were encountered while processing:
  • ERROR: for build_env Cannot create container for service build_env: create .: volume name is too short, names should be at least two alphanumeric characters
  • node-pre-gyp install failed with error: error: command failed: node-pre-gyp install --fallback-to-build
  • Errors were encountered while processing: linux-image-5.4.0-71-generic linux-image-5.4.0-70-generic
  • Error: error modifying EC2 Volume "vol-04e2b1a2d03860650": InvalidParameterValue: New size cannot be smaller than existing size
  • msg="could not create cluster: could not create pod disruption budget: poddisruptionbudgets.policy \"postgres-fx-postgres-pdb\" already exists"
  • The process cannot access the file because it is being used by another process. Press any key to continue...
  • docker error "[email protected]" is an optional dependency and failed compatibility check. Excluding it from installation.
  • error uncompressing archive : unable to created directory /var/jenkins_home_restore
  • dpkg --configure -a » pour corriger le problème.
  • unable to locate package php-xmlrpc
  • compilation failed for package in r ubuntu
  • Failure [INSTALL_FAILED_UPDATE_INCOMPATIBLE: Package com.ccc.notification signatures do not match previously installed version; ignoring!]
  • GVfs metadata is not supported. Fallback to TeplMetadataManager.
  • name is expected to be in the format /type0=value0/type1=value1/type2=... where characters may be escaped by \. This name is not in that format: 'C:/Program Files/Git/C=ZA/CN=RootCA-CA' problems making Certificate Request
  • user permission for running laravel in ubuntu
  • no match for argument kernel-devel-uname-r
  • You must specify at least one graphical backend feature: "metal", "vulkan", "empty"
  • docker Unable to setup unix socket lock file
  • pacman manager package invalid problem
  • gradle hash file not found
  • ubuntu r package install problem
  • The following signatures were invali gpg
  • fix errors occurred when installing a file in linux
  • add-apt-repository universe invalid
  • var/lib/dpkg/info/ubuntu-advantage-tools.prerm:%20py3clean:%20not%20found
  • Could not find a production build in the '/home/rng70/github/xira/.next' directory. Try building your app with 'next build' before starting the production server. https://nextjs.org/docs/messages/production-start-no-build-id
  • react native android stuck on %99 app:install debug
  • Errors: grub-efi-amd64-signed & shim-signed
  • remove gpg error on your installed app or package
  • il pacchetto non è valido oppure è corrotto (firma PGP):
  • yarn <pre>00h00m00s 0/0: : ERROR: There are no scenarios; must have at least one. </pre>
  • fatal: malformed object name HEAD
  • fit gnuplot error bars
  • docker gnupg, gnupg2 and gnupg1 do not seem to be installed, but one of them is required for this operation
  • ERROR: Error installing jekyll:ERROR: Failed to build gem native
  • Errors were encountered while processing: ubuntu
  • [ERROR] An error occurred while running subprocess capacitor.
  • fatal: bad numeric config value 'null' for 'commit.gpgsign': invalid unit
  • Failed to download pear within preferred state "stable"
  • unable to save pyhon file in wsl
  • error couldn't install package pillow big sur
  • rails server already running
  • grep ip address
  • git match remote master
  • list used ports on mac
  • sudo ufw status Status: inactive
  • remove git credentials terminal
  • install angular cli
  • linux install pip
  • install tmux ubuntu
  • how to remove git from project
  • how to remove an apt repository
  • check installed packages apt-get
  • E: Unable to fetch some archives, maybe run apt-get update or try with --fix-missing?
  • adding jars to classpath in linux
  • brew install atom
  • change process name pm2
  • how to install blender 2.8 from a ubuntu linux terminal
  • ubuntu gpg 2
  • pod deintegrate
  • shell promt user input
  • gyp error npm install
  • set up git repository
  • openssl view certificate
  • how to Install nodejs on a chromebook
  • Failed at the [email protected] postinstall script.
  • install dependencies @material-ui/lab/Rating
  • bash display items in array
  • git show staged files
  • using wget with a proxy
  • show directory size linux
  • extract tar.xz ubuntu
  • apache basic auth setup
  • pipenv an error occurred while installing psycopg2==2.8.4
  • npm install cli vue
  • how to start a web server linux
  • kill a port
  • sudoers nopasswd
  • archlinux install chrome
  • terminal how to find a directory
  • git grep across all branches
  • git pull hard
  • git undo rebase
  • xcode path mac
  • pytorch anaconda install windows
  • checking if a substring exists in a string bash
  • install tensorflow
  • local-gen install
  • can we declare state outside the class
  • how to grep if the first letter is a character not a number
  • aws cli config profile
  • save android studio home bash_profile
  • scp download file
  • git remove cached directory
  • git clone submodule
  • how to unstage changes in git
  • bash wait 3 seconda
  • remove all iptables rules
  • CommandNotFoundError: Your shell has not been properly
  • install rancher
  • npm install bootstrap
  • install homebrew on mac
  • wmv to mp4 ffmpeg
  • add a cookie to curl
  • installing react router dom with yarn
  • shell foreach line
  • rails no migration with version number
  • edit branch name git
  • Failed to set up listener: SocketException: Address already in use
  • compress folder ubuntu
  • flutter create command
  • brew mongodb: unknown version :mountain_lion
  • pip3 install from git
  • docker remove all images powershell
  • laravel installation from github
  • git change git commit date
  • git view stash
  • linux external hard drive chmod
  • Required Windows feature(s) not enabled : Hyper-V and Containers
  • launch bash script from application mac without opening terminal
  • install spectacle brew
  • turn redis off
  • revert commit git
  • git push to another repository
  • git search all commits for string
  • how to add a gif to a readme
  • windows features windows subsystem for linux not
  • iis restart cfrom command promt windows
  • how to install pytorch 0.4.1
  • .gitignore
  • git revert pr merge
  • kubernetes auto complete
  • how to totally uninstall prettier
  • install docker linux
  • heic open linux
  • how to search the memory for the address of bin/sh
  • bash change file extension
  • how to kill a process in linux
  • bash call another script relative to current script
  • download images from url terminal
  • how to copy file in root directory
  • docker command to login with user name and pass word
  • rials db down
  • check logstash config
  • interesting bash scripts
  • check os shell liunx cygwin darwin
  • sound output raspberry pi
  • github commit
  • heroku run knex migrations
  • zshrc
  • composer add package
  • mate on ubuntu 20.04
  • how to delete files in linux
  • rename file linux
  • docker compose installation
  • powershell search array
  • update all packages in cmd
  • bash count files in directory recursively matchingattern
  • powershell script run
  • very strong ssh encryption key
  • error: eaccess: permission denied ionic
  • homestead.yaml adding provisions
  • how to turn off aslr in gcc
  • how to use nano instead of vi
  • gitlab download
  • how to install cab file in ubuntu
  • update cordov ios
  • rman commands
  • move all subfolders to parent folder linux
  • authentication failed github
  • diff remote file
  • make a batch file that accepts pipe input
  • is there a steam repository for kali linux
  • what does worktree prune do
  • windows virtualenv pip numpy problem
  • xampp in manjaro linux
  • digital bootcamps in gauteng
  • sed only keep string between brackets
  • no module named typedefs pyinstaller
  • réinstaller interface graphique debian
  • docker image layer storage windows
  • job('DSL-Tutorial-1-Test') { scm { git('git://github.com/quidryan/aws-sdk-test.git') } triggers { scm('H/15 * * * *') } steps { maven('-e clean test') } }
  • connecting to timescaledb from terminal
  • how to convert a multy digit array into a whole number
  • always asks for ssh-add
  • error: src refspec master does not match any. git
  • git allow unrelated histories
  • refusing to merge unrelated histories
  • refusing to merge unrelated histories git
  • 'react-scripts' is not recognized as an internal or external command, operable program or batch file.
  • react-scripts is not recognized as an internal command windows
  • error: failed to push some refs to
  • yarn: command not found
  • how to install yarn on local development machine
  • install yarn
  • YarnInstall
  • bash: yarn: command not found
  • how to install yarn
  • install ayrn npm
  • yarn install
  • Install yarn via npm global
  • pg_config executable not found
  • install postgresql on mac
  • homebrew postgres
  • postgres cli
  • install postgresql 12.4 home brew
  • bootstrap color
  • error: src refspec master does not match any.
  • storage/logs/laravel.log" could not be opened: failed to open stream: permission denied
  • error: src refspec master does not match any error: failed to push some refs to android studio
  • react native git error: src refspec main does not match
  • zsh: command not found: npm
  • bash: nvm: command not found
  • npm ERR! code ERESOLVE npm ERR! ERESOLVE unable to resolve dependency tree npm ERR! npm ERR!
  • Unable to resolve dependency tree error when installing npm packages
  • npm ERR! ERESOLVE unable to resolve dependency tree
  • flutter android sdk manager not found
  • flutter Android sdkmanager not found. Update to the latest Android SDK and ensure that the cmdline-tools are installed to resolve this.
  • Flutter doctor error - Android sdkmanager tool not found. Windows
  • flutter android sdkmanager not found
  • zsh: command not found
  • Error: Node Sass does not yet support your current environment: Windows 64-bit with Unsupported runtime
  • node sass does not yet support your current environment windows 64-bit angular
  • OS X 64-bit with Unsupported runtime (93)
  • Module build failed: Error: Node Sass does not yet support your current environment: OS X 64-bit with Unsupported runtime (79)
  • Error: Node Sass does not yet support your current environment
  • git error:[email protected]: Permission denied (publickey). fatal: Could not read from remote repository. Please make sure you have the correct access rights and the repository exists.
  • xcrun: error: invalid active developer path (/Library/Developer/CommandLineTools), missing xcrun at: /Library/Developer/CommandLineTools/usr/bin/xcrun
  • pathspec 'corp-branch' did not match any file(s) known to git
  • Could not install packages due to an OSError: [WinError 5] Access is denied:
  • requireNativeComponent: "RNCSafeAreaProvider" was not found in the UIManager.
  • add-apt-repository command not found
  • git stop stash merge
  • you need to resolve your current index first
  • error: you need to resolve your current index first git
  • git merge errors
  • How to undo a git merge with conflicts
  • git reset stash conflict
  • The following signatures couldn't be verified because the public key is not available: NO_PUBKEY
  • The following signatures couldn't be verified because the public key is not available: NO_PUBKEY 67ECE5605BCF1346
  • zsh: command not found: brew
  • failed to push some refs to repository
  • nodemon command not found linux
  • ERROR: Could not install packages due to an EnvironmentError: [WinError 5] Access is denied: 'd:\\anaconda3\\scripts\\pip.exe' Consider using the `--user` option or check the permissions.
  • error: The following untracked working tree files would be overwritten by merge:
  • error: The following untracked working tree files would be overwritten by merge: static/platform_images/landing_page_img.png Please move or remove them before you merge. Aborting
  • Error: PostCSS plugin tailwindcss requires PostCSS 8.
  • postcss plugin tailwindcss requires postcss 8. migration guide for end-users
  • libgthread-2.0.so.0: cannot open shared object file: No such file or directory
  • pip command not found macos
  • pip install failing on python2?
  • zsh command not found nvm mac
  • command not found: nvm
  • brew not found
  • you failed to push some refs to git
  • Could not find the implementation for builder @angular-devkit/build-angular:dev-server
  • Module not found: Can't resolve '@material-ui/core/Button'
  • No Xcode or CLT version detected!
  • xcode-selec not working
  • gyp: No Xcode or CLT version detected!
  • fatal: remote origin already exists.
  • npm ERR! cb() never called!
  • sudo command not found
  • remote: HTTP Basic: Access denied fatal: Authentication failed for
  • Permission denied (publickey,gssapi-keyex,gssapi-with-mic).
  • error: failed to push some refs to 'https://github.com/KARBOUZE/OpenclassroomsProject.git'
  • wsl ERROR 2002 (HY000): Can't connect to local MySQL server through socket '/var/run/mysqld/mysqld.sock' (2)
  • cannot find module 'sass' vue
  • Error: Node Sass does not yet support your current environment: Linux 64-bit with Unsupported runtime (83)
  • ubuntu run in port 80
  • Not Found The requested URL was not found on this server. Apache/2.4.41 (Ubuntu) Server at localhost Port 80
  • windows fatal: unable to access SSL certificate problem: unable to get local issuer certificate
  • fatal: unable to access 'https://gitlab.operasolutions.com/poc/jpm-demo.git/': SSL certificate problem: unable to get local issuer certificate
  • update git repository
  • update repo
  • error: The following untracked working tree files would be overwritten by merge: .DS_Store .gitignore Please move or remove them before you merge.
  • npm command not found
  • npm install cannot read property 'match' of undefined
  • ifconfig command not found
  • npm -v -bash: /usr/bin/npm: No such file or directory
  • usr/bin/env: ‘node’: No such file or directory
  • fatal: refusing to merge unrelated histories
  • steam is not in the sudoers file.
  • Module not found: Can't resolve 'axios' in 'C:\Users\
  • Module not found: Can't resolve 'react-scroll'
  • laravel mix ERROR in ./resources/js/bootstrap.js 8:15-31 Module not found: Error: Can't resolve 'axios'
  • scroll in react
  • git error: cannot lock ref 'refs/remotes/origin/master': unable to resolve reference 'refs/remotes/origin/master': reference broken
  • nvm command not found
  • kill process cmd
  • Port 3000 is already in use, but when I try to kill nothing is found
  • wget command not found mac
  • command ng not found
  • command ng not foudn
  • 'touch' is not recognized as an internal or external command,
  • pytesseract.pytesseract.TesseractNotFoundError: tesseract is not installed or it's not in your PATH. See README file for more information.
  • failed to restart mysql.service: unit mysql.service not found.
  • CocoaPods could not find compatible versions for pod "EXFileSystem
  • Command 'ng' not found, but can be installed with:
  • docker access denied
  • Server: ERROR: Got permission denied while trying to connect to the Docker daemon socket
  • conda command not found linux
  • zsh: command not found: flutter
  • node sass install error
  • /bin/bash^M: bad interpreter: No such file or directory
  • bash firebase command not found
  • 'vue-cli-service' is not recognized as an internal or external command, operable program or batch file.
  • /usr/bin/env: ‘bash\r’: No such file or directory
  • error: command 'x86_64-linux-gnu-gcc' failed with exit status 1
  • error: cannot open .git/FETCH_HEAD: Permission denied
  • docker compsoe ubuntu
  • docker-compose permission denied
  • install docker-compose ec2
  • Apply executable permissions to the binary: permission denied
  • ubuntu The following signatures couldn't be verified because the public key is not available: NO_PUBKEY
  • bash: docker-compose: command not found...
  • cannot find module 'path' or its corresponding type declarations
  • heroku command not found
  • error: You have not concluded your merge (MERGE_HEAD exists).
  • flutter doctor android licenses exception in thread main java.lang.noclassdeffounderror
  • flutter doctor android license status unknown
  • flutter license NoClassDefFoundError
  • flutter doctor --android-licenses error
  • flutter doctor android license exception in thread main
  • flutter doctor --android-licenses java error
  • zsh: command not found: nvm
  • src refspec main does not match any
  • 'keytool' is not recognized as the name of a cmdlet
  • modulenotfounderror tqdm
  • ModuleNotFoundError: No module named 'tqdm'
  • pip install tqdm
  • Failed to install the following Android SDK packages as some licences have not been accepted. build-tools;28.0.3 Android SDK Build-Tools 28.0.3 platforms;android-29 Android SDK Platform 29
  • ERROR:uvicorn.error:[Errno 98] Address already in use
  • mac error that port is already in use
  • flutter android sdk file not found
  • flutter doctor android license error
  • ERROR: Could not install packages due to an OSError: [WinError 5] Access is deni ied: 'C:\\Users\\ok\\AppData\\Local\\Temp\\pip-uninstall-vl2o0dwn\\pip.exe' Consider using the `--user` option or check the permissions.
  • Got error: 1698: Access denied for user 'root'@'localhost' when trying to connect
  • ERROR 1698 (28000): Access denied for user 'root'@'localhost'
  • VS Code can't see other branches that were created online
  • branches not showing github
  • Fetch all braches in git
  • visual studio code branch doesn't show
  • error while loading shared libraries: libaio.so.1: cannot open shared object file: No such file or directory"
  • Exception: Error running pod install
  • libnss3.so: cannot open shared object file: No such file or directory
  • you have not concluded your merge (merge_head exists)
  • error: RPC failed; curl 18 transfer closed with outstanding read data remaining fatal: the remote end hung up unexpectedly
  • cloning a repository that says not found
  • how to log out globally from github mac
  • ImportError: /usr/lib/x86_64-linux-gnu/libstdc++.so.6: version `GLIBCXX_3.4.22' not found
  • error: insufficient permission for adding an object to repository database .git/objects
  • Updating from such a repository can't be done securely, and is therefore disabled by default. not secured Release' is not signed.
  • does not have a Release file. N: Updating from such a repository can't be done securely, and is therefore disabled by default. N: See apt-secure(8) manpage for repository creation and user configuration details
  • curl not found
  • TypeError: __init__() got an unexpected keyword argument 'column'
  • Port 8080 was already in use.
  • Failed to start The Apache HTTP Server.
  • ERROR: Could not find a version that satisfies the requirement cv2 (from versions: none)
  • apt-add-repository command not found
  • pod install [!] No `Podfile' found in the project directory. react-native
  • Updating Node.js to v12
  • npm does not support Node.js v10.19.0
  • npm does not support Node.js v10.24.0
  • flutter : command not found
  • could not connect to server: No such file or directory Is the server running locally and accepting connections on Unix domain socket "/tmp/.s.PGSQL.5432"?



In this MongoDB tutorial, I will explain how I managed to resolve the error “E: Sub-process /usr/bin/dpkg returned an error code (1)”.

  • Sub-process /usr/bin/dpkg returned an error code (1)
  • Reason: Sub-process /usr/bin/dpkg returned an error code (1)
  • Solution: Sub-process /usr/bin/dpkg returned an error code (1)
  • Conclusion

Sub-process /usr/bin/dpkg returned an error code (1)

Recently, when I was trying to install the MongoDB database in the ubuntu operating system (20.04), I faced the error “Sub-process /usr/bin/dpkg returned an error code (1)“. You can see the error below:

Sub process dpkg returned an error code (1)

I properly followed the correct command, but still faced this error.

Don’t worry if you don’t know how to resolve these issues. In the below steps, we will discuss the reason for getting the error and also resolve the error.

Reason: Sub-process /usr/bin/dpkg returned an error code (1)

When I searched it on the web, I found many posts and blogs on this error. Most of the blogs stated that this error was triggered because of a failed software installation or the installer becomes corrupted.

So if it is damaged and you are trying any new software installation will cause this error message.

Solution: Sub-process /usr/bin/dpkg returned an error code (1)

When I was trying to troubleshoot this error in the Ubuntu operating system. I found the solution for this.

The installer becomes corrupted that is the only reason we are getting errors. The key phrase in the error is /usr/bin/dpkg. Here, the dpkg is the package installer for Linux and it tracks software updates and dependencies.

Now, follow the below steps to fix the error dpkg returned an error code 1:

  • Open the terminal
  • Use the below code to move the dpkginfo file into another file

Here, we moved the info file into the info_silent file on the same path “/var/lib/dpkg/info_silent”. You can take any name for the new file (info_silent).

  • Now create a new directory info in dpkg folder, use the below command
  • Excute the update command to download package information from all configured sources
dpkg returned an error code
  • Excute the below command to check the dependencies of the packages you want and install any that are needed.

Here, this command will install the MongoDB database and also check the dependencies that are needed to install.

Solution dpkg returned an error code (1)
  • After installing all the dependencies move all the file of the info directory into info_silent directory.
  • Remove the info directory, use the below command
  • Now, again move all the file of the info_silent directory into the info directory.
  • Use the below code to updates the list of available packages and their versions
  • After updating the lists, the package manager knows about available updates for the software you have installed.
  • Use the upgrade command to installs newer versions of the packages you have.
Solution Sub-process dpkg returned an error code (1)
  • Now we resolved the error and successfully installed the MongoDB without any error fall.
  • Check the version of MongoDB, use the below command
MongoDB dpkg returned an error code (1)

Conclusion

The “sub-process /usr/bin/dpkg returned an error code (1)” indicates that there is a problem with the package installer, which is generally caused by an interrupted installation process or a corrupted database.

You may also like to read the following MongoDB tutorials.

Thus, you might have learned the cause and the solution of the error Sub-process /usr/bin/dpkg returned an error code (1).

  • Sub-process /usr/bin/dpkg returned an error code (1)
  • Reason: Sub-process /usr/bin/dpkg returned an error code (1)
  • Solution: Sub-process /usr/bin/dpkg returned an error code (1)
  • Conclusion
Bijay Kumar Sahoo

Bijay Kumar Sahoo

After working for more than 15 years in the Software field, especially in Microsoft technologies, I have decided to share my expert knowledge of SQL Server. Check out all the SQL Server and related database tutorials I have shared here. Most of the readers are from countries like the United States of America, the United Kingdom, New Zealand, Australia, Canada, etc. I am also a Microsoft MVP. Check out more here.

grep -i package_name

After listing the files, you can move them to the /tmp directory as shown

$ sudo mv /var/lib/dpkg/info/package-name.* /tmp

Alternatively, you can use the rm command to manually remove the files.

$ sudo rm -r /var/lib/dpkg/info/package-name.*

Finally, update the package lists as shown:

$ sudo apt update

You can thereafter give it another shot in reinstalling the software package.

Conclusion

This type of dpkg error points to an issue with the package installer usually caused by the interruption of an installation process or a corrupt dpkg database.

Any of the above-mentioned solutions should fix this error. If you have come this far, then it’s our hope that the issue has been successfully resolved and that you were able to reinstall your software package.

Tags fix, Ubuntu FAQ's, Ubuntu Tips

If you liked this article, then do subscribe to email alerts for Linux tutorials. If you have any questions or doubts? do ask for help in the comments section.

If You Appreciate What We Do Here On TecMint, You Should Consider:

TecMint is the fastest growing and most trusted community site for any kind of Linux Articles, Guides and Books on the web. Millions of people visit TecMint! to search or browse the thousands of published articles available FREELY to all.

If you like what you are reading, please consider buying us a coffee ( or 2 ) as a token of appreciation.

Support Us

We are thankful for your never ending support.