Syntax error, unexpected $end in

syntax error, unexpected $end in

I am unable to do anything after this dialog box appears: /home/hp/.profile: line 31:syntax error:unexpected end of file As a result the. The reason why this error occurs is having a space either before or after the closing delimiter identifier. For instance, in our example above. Parse error or syntax error occurs when you missed bracket (}) at the end. · When you write if condition and forgot the parenthesis –) -. · At the end of line.

Phrase: Syntax error, unexpected $end in

Smart 301 hard drive error
ERROR 503 RSBUDDY
Ros brown-driver install error
', expecting variable (T_VARIABLE) in /private/var/www/api/vendor/psr/log/src/LoggerInterface.php on line 30
  • SQLSTATE[42S02] lumen
  • Array and string offset access syntax with curly braces is no longer supported in C:\xampp\htdocs\e-exam\PHPExcel\PHPExcel\Shared\String.php on line 529
  • Syntax error or access violation: 1071 Specified key was too long; max key length
  • object of class stdclass could not be converted event id 1003 system error string php laravel
  • Invalid datetime format: 1366 Incorrect string value
  • Column not found: 1054 Unknown column 'api_token' in 'where clause
  • Call to undefined function GuzzleHttp\_idn_uri_convert()
  • limit query codeiniter 3
  • php Unexpected $end in Undefined variable inside array_map
  • invalid_scope 'Custom scopes are not allowed for this request.' okta
  • sqlstate[22023]: invalid parameter value:
  • error": "Trying to get property 'id' of non-object" in syntax error to undefined method Psy\Util\Str::random()
  • mysqli_num_rows() expects parameter 1 to be mysqli_result, boolean given
  • ERROR 1071 (42000) at line 76: Specified key was too long; max key length is 767 bytes laravel
  • In QueryRecorder.php line 22: Argument 2 passed to Facade\Ignition\QueryRecorder\QueryRecorder::__construct() must be of the type bool, unexpected $end in, unexpected $end in given,
  • Uncaught Error: Call to undefined function add_submenu_page()
  • Function create_function() is deprecated in
  • warning: parameter 2 to search_by_title() expected to be a reference, syntax error, value given inwp-includes\class-wp-hook.php on line 287
  • php 7 The each() function is deprecated.
  • Parse error: syntax error, unexpected '' (T_ENCAPSED_AND_WHITESPACE), expecting '-' or identifier (T_STRING) or variable (T_VARIABLE) or number (T_NUM_STRING)
  • Uninitialized string offset
  • Undefined property: stdClass::$
  • Call to undefined method CI_DB_mysqli_result::order_by()
  • php Undefined index: error
  • how to prevent the Undefined index in php
  • Parse error: syntax error, unexpected $end in, unexpected token "{" in C:\xampp\htdocs\loginsystem1\welcome.php on line 3
  • str_replace(): Passing null to parameter #3 ($subject) of type array

    Dynare Forum

    Dear friends,
    i am a beginner to DSGE, and confused by the error notice after running this simple NK.mod. NK.mod (1.3 KB)
    Looking forward to your comments.Thanks!

    Appendix of code//NK model
    //NK model
    var Y I C R K W L MC P PI A;
    varexo e;
    parameters sigma phi alpha beta delta rhoa psi theta;

    sigma = 2;
    phi = 1.5;alpha = 0.35;beta = 0.985; delta = 0.025; rhoa = 0.95; psi = 8;theta = 0.75;

    model(linear);
    #Pss = 1;
    #Rss = Pss *((1/beta)-(1-delta));
    #MCss = ((psi-1)/psi) *(1-beta *theta) *Pss;
    #Wss = (1-alpha) *(MCss^(1/(1-alpha))) *((alpha/Rss)^(alpha/(1-alpha)));
    #Yss = ((Rss/(Rss-delta *alpha *MCss))^(sigma/(sigma+phi))) *((Wss/Pss) *(Wss/((1-alpha) *MCss))^phi)^(1/(sigma+phi));
    #Kss = alpha * MCss * (Yss/Rss);
    #Iss = delta * Kss;
    #Css = Yss - Iss;
    #Lss = (1-alpha) * MCss * (Yss/Wss);

    //1-Labor supply
    sigma *C + phi *L = W - P;
    //2-Euler equation
    (sigma/beta) *(C(+1)-C)=(Rss/Pss) *(R(+1)-P(+1));
    //3-Law of motion of capital
    K = (1-delta) *K(-1) + delta *I;
    //4-Production function
    Y = A + alpha *K(-1) + (1-alpha) *L;
    //5-Demand for capital
    K(-1) = Y - R;
    //6-Demand for labor
    L = Y - W;
    //7-Marginal cost
    MC = (1-alpha) *W + alpha *R - A;
    //8-Phillips equation
    PI = beta *PI(+1)+((1-theta) *(1-beta *theta)/theta) *(MC-P);
    //9-Gross inflation rate
    PI = P - P(-1);
    //10-Goods market equilibrium condition
    Yss *Y = Css *C + Iss *I;
    //11-Productivity shock
    A = rhoa *A(-1) + e;
    end;

    steady;
    check(qz_zero_threshold=1e-20);

    shocks;
    var e;
    stderr 0.01;
    end;

    stoch_simul(nograph,qz_zero_threshold=1e-20) Y I C R K W L PI A;

    “Parse error: syntax error, unexpected end of file in” Code Answer

    Grepper Logo



    Line : 83 -- syntax error, unexpected $end in, unexpected end of file php


    Answers related to “Parse error: syntax error, unexpected end of file in”


    Queries related to “Parse error: syntax error, unexpected end unexpected $end in file in”

    • syntax error, unexpected end of file php
    • syntax error unexpected end of file php
    • php unexpected end of file
    • parse error syntax error unexpected end of file in php
    • Parse error: syntax error, syntax error, unexpected end of file php
    • Parse error: syntax error, unexpected end of file in php
    • Parse error: syntax error, unexpected $end in, unexpected end of file in
    • syntax error, unexpected end of file in php
    • syntax error, unexpected $end in, unexpected end of file php file
    • unexpected end of file error in php
    • php ?> error Parse error: syntax error, syntax error, unexpected end of file in
    • Parse error: syntax error, unexpected '<', syntax error, syntax error end of file
    • syntax error, unexpected end of file functions.php
    • html end of the file
    • Fatal error: Uncaught Error: syntax error, unexpected end of file php
    • unexpected end of file in Command line code on line 1 php
    • unexpected < expecting end of line
    • arse error: syntax error, unexpected end of file in
    • Parse error: syntax error, unexpected $end in
    • PHP message: PHP Parse error: syntax error, syntax error, unexpected end of file
    • PHP Parse error: syntax error, unexpected $end in, unexpected end of file php
    • ParseError: syntax error, unexpected '<', expecting end of file in license.php
    • php error syntax error, unexpected end of file
    • Parse error: syntax error, unexpected end of file in php and html
    • Parse syntax error syntax error, unexpected end of file in /
    • Parse error: syntax error, unexpected end of file php
    • unexpected end of file php
    • PHP Parse error: syntax error, unexpected end of file in
    • PHP Parse error: syntax error, unexpected end of file
    • syntax error unexpected end of file in php
    • php syntax error, syntax error, unexpected end of file in
    • expecting end of file in
    • Parse error: syntax error, unexpected end of file
    • syntax error, unexpected end of file in php\
    • syntaxerror unexpected end of file php
    • php parse error unexpected end of file
    • error php unexpected end of file in
    • unexpected end of file in Command line code on line 1
    • syntax error, unexpected end unexpected $end in file in html php
    • syntax error, unexpected end of file in php file
    • A PHP Error was encounteredSeverity: Parsing ErrorMessage: syntax error, unexpected $end
    • syntax error, unexpected end of file eval php
    • unexpected < in php file
    • end of file error in php
    • PHP Parse error: syntax error, syntax error, unexpected end of file php7
    • PHP message: PHP Parse error: syntax error, unexpected $end in, unexpected end of file in
    • PHP Parse error: syntax error, unexpected '<', syntax error, expecting end of file in E:\ehave_new\ehave\vendor\composer\ClassLoader.php on line 791
    • PHP Parse error: syntax error, unexpected end of file in Solution.php on line 40
    • Parse error: syntax error, unexpected unexpected $end in of file with php in syntax error syntax error, unexpected end of file in /var/www/html/index.php(5) : eval()'d code on line 1
    • php xml syntax error, unexpected end of file
    • unexpected EOF at end of php file
    • Line : 83 -- syntax error, unexpected end of file php
    • php syntax error, unexpected end of file
    • syntax error, unexpected '<', expecting end of file
    • php unexpected eof
    • Parse error: syntax error, unexpected 'location' (T_STRING) in C:\xampp\htdocs\loginsystem\login.php on line 23
    • php syntax error unexpected end of file
    • php error unexpected end of file
    • syntax error, unexpected end of file php short open tag
    • php syntax error unexpected end of file in command line code on line
    • ( ! ) Parse syntax error syntax error, unexpected $end in
    • error unexpected end of file in php
    • syntax error, unexpected end of file php endif
    • syntax error, unexpected end of file in ph p
    • how to fix unexpected end of file in php
    • unexpected end of file error in web.php
    • Unexpected 'EndOfFile' php
    • unexpected end of file
    • syntax error unexpected end of file php html
    • parsing error php file
    • parser error when row has file php
    • : syntax error, unexpected end of file in
    • ParseError syntax error, unexpected end of file
    • Parse syntax error syntax error, syntax error, unexpected end of file php ubuntu
    • Parse error: syntax error, unexpected end of file in in php api
    • php: error error - unexpected end of file in Standard input code



    Browse PHP Answers by Framework


    More “Kinda” Related Error 1 error c2065 cin undeclared identifier View All PHP Answers »

    • PDOException::("SQLSTATE[42000]: Syntax error or access violation: 1071 Specified key was too long; max key length is 1000 bytes") laravel 8
    • the $request argument is type-hinted with the non-existent class or interface: "App\Controller\Request".
    • Unable to resolve NULL driver for [Maatwebsite\Excel\Transactions\TransactionManager].
    • htaccess post max size
    • In PackageManifest.php line 131: Undefined index: name laravel 7
    • Call to undefined function App\Models\str_slug()
    • Call to undefined function str_limit() laaravel8
    • Syntax error or access violation: 1071 La clé est trop longue, syntax error. Longueur maximale: 1000
    • Syntax error or access violation: 1072 Key column 'user_id' doesn't exist in table (SQL: alter table `groups` add constraint `groups_user_id_foreign` foreign key (`user_id`) references `users` (`id`))
    • PHP Fatal error: Call to undefined function factory() in Psy Shell code on line 1, LARAVEL 8 Issue solved
    • must be an instance of Illuminate\\Http\\Request
    • Error Call to undefined function CodeIgniter\locale_set_default()
    • object of class symfony\component\form\formview could not be converted to string
    • E: Unable to locate package php7.2-mbstring
    • PHP Warning: 'C:\Windows\SYSTEM32\VCRUNTIME140.dll' 14.0 is not compatible with this PHP build linked with 14.28 in Unknown on line 0
    • E: Couldn't find any package by regex 'php7.2-json'
    • 419 unknown status
    • Error: Call to a member function addEagerConstraints() on null in file
    • passed to Lcobucci\JWT\Signer\Hmac::doVerify() must be an instance of Lcobucci\JWT\Signer\Key, null given,
    • Fatal error: Maximum execution time of 120 seconds exceeded in
    • Object of class DateTime could not be converted to string
    • SQLSTATE[42000]: Syntax error or access violation: 1071 Specified key was too long; max key length is 1000 bytes
    • SQLSTATE[42000]: Syntax error or access violation: 1071
    • main.WARNING: Session size of 315269 exceeded allowed session max size of 256000
    • Syntax error or access violation: 1071 Specified key was too long; max key length is 1000 bytes (SQL: alter table `users` add index `users_userable_type_userable_id_index`(`userable_type`, `userable_id`)
    • InvalidArgumentException Unknown format "sentence"
    • incorrect format parameter phpmyadmin xampp
    • Internal error: xmlSchemaDocWalk, calling xmlSchemaValidateElem().
    • Invalid Document Element 'item': The type definition is abstract. Line: 27 : While setup:upgrade magento
    • Internal error: xmlSchemaXPathProcessHistory, unexpected $end in, The state object to be removed is not the first in the list.
    • Internal error: xmlSchemaValidateChildElem, calling xmlRegExecPushString2().
    • Yii2 Stripe Unexpected $end in testing: "[ERROR] Failed to Post"
    • Uncaught Error: Call to undefined function "themeblvd_add_builder_element()"
    • PHP Fatal error: Constructor test::test() cannot declare a return type in /home/iBMCb9/prog.php on line 6
    • Fatal error: Allowed memory size of 536870912 bytes exhausted (tried to allocate 119541600 bytes) in C:\xampp\htdocs\backup-vice.php on line 67
    • func_get_args with keys
    • Call to undefined function mysql_connect()
    • Cannot use object of type stdClass as array
    • Message: Too few arguments to function Admin::tindakan_vaksin1(), 1 passed in C:\xampp\htdocs\login\system\core\CodeIgniter.php on line 532 and exactly 2 expected
    • increase the syntax error Undefined property: enable_for_virtual
    • Notice: Undefined property:
    • htmlspecialchars() expects parameter 1 to be string
    • Uncaught (in promise) TypeError: Cannot read properties of null (reading 'fingerprint') sortable livewire
    • How to fix undefined index: name in PackageManifest.php line 131 error with Composer
    • PHP Deprecated: Function create_function()
    • SQLSTATE[42S02]: Base table or view not found: 1146 Table 'laravel_api.sessions' doesn't exist (SQL: select * from `sessions` where `id` = sXWuwluhxC2HlCzzq7jDyPGJFriLGdxQj8bPtcgC limit 1)
    • Array and string offset access syntax with curly braces is deprecated in tcpdf.php
    • oci_execute(): ORA-01810: format code appears twice in
    • Allowed memory size of 134217728 bytes exhausted (tried to allocate 20480 bytes)
    • Allowed memory size of 33554432 bytes exhausted (tried to allocate 43148176 bytes) in php
    • Warning: mysqli_fetch_all() expects parameter 1 to be mysqli_result, bool given in C:\newxammp\htdocs\learn\index.php on line 11
    • invalid datetime format 1292
    • Fatal error: Cannot redeclare
    • Cross-site request forgery validation failed. Unexpected $end in param "state" missing from persistent data
    • [Doctrine\DBAL\DBALException]Unknown database type enum requested, Doctrine\DBAL\Platforms\MySqlPlatform may not support it.
    • malformed utf-8 characters possibly incorrectly encoded php
    • Allowed memory size of 1610612736 bytes exhausted laravel
    • Warning: mysqli_num_rows() expects parameter 1 to be mysqli_result, bool given in
    • lluminate\Http\Exceptions\PostTooLargeException
    • utf8 php
    • $conn->query("SET NAMES utf8");
    • set names utf8
    • php check undefined offset
    • string data, right truncated: 1406 data too long for column body at row 1 laravel
    • Warning: mysqli_error() expects exactly 1 parameter, 0
    • Laravel\Socialite\Two\InvalidStateException
    • PHP Fatal error: Allowed memory size of 1610612736 bytes exhausted (tried to allocate 4096 bytes)
    • laravel carbon Could not parse '28/09/2021, 12:00:00 pm': DateTime::__construct(): Failed to parse time string (28/09/2021, 12:00:00 pm) at position 0 (2): Unexpected character
    • Syntax error or access violation: 1071 Specified key was too long;
    • Fatal error: Allowed memory size of 1610612736 bytes exhausted
    • A non well formed numeric value encountered
    • laravel-socialite-invalidstateexception
    • Missing expression. (near "ON" at position 25)
    • Fatal error: Allowed memory size of 1610612736 bytes exhausted but already allocated 1.75G
    • Exception #0 (Magento\Framework\Exception\ValidatorException): Invalid template file:
    • Line : 83 -- syntax error, unexpected end of file php
    • warning illegal string offset
    • Notice: Trying to access array offset on value of type int in /var/www/pdam/modules/phpexcel/PHPExcel/Cell/DefaultValueBinder.php on line 82
    • Fatal error: Exception thrown without a stack frame in Unknown on line php
    • php undefined index
    • schema defaultstringlength(191)
    • 191 too long
    • PDOException::("SQLSTATE[42000]: Syntax error or access violation: 1071 Specified key was too long; max key length is 1000 bytes")
    • Schema::defaultStringLength(191)
    • Laravel Syntax error or access violation: 1071 Specified key was too long
    • Illuminate\Database\QueryExcep Syntax error or access violation: 1071 Specified key was too long; max key length is 1000 bytes (SQL: alter table `users` add unique `users_email_unique`(`email`)) laravel
    • Laravel Migration Error: Syntax error or access violation: 1071 Specified key was too long; max key length is 767 bytes
    • how to fix PHP Fatal error: Allowed memory size of 1610612736 bytes exhausted
    • Allowed memory size of 1610612736 bytes exhausted 4096
    • Notice: ob_end_flush(): failed to send buffer of zlib output compression (1) in
    • Malformed UTF-8 characters, possibly incorrectly encoded
    • PHP Fatal error: Allowed memory size of 134217728 bytes exhausted
    • invalid_taxonomy
    • Only variables should be passed by reference in
    • Call to a member function move() on string
    • I can't chage post_max_size
    • Array and string offset access syntax with curly braces is deprecated
    • Object of class Illuminate\\Database\\Eloquent\\Builder could not be converted to string
    • php undefined function mysqli_fetch_all()
    • Allowed memory size of 1610612736 bytes exhausted (tried to allocate 4096 bytes) laravel
    • Trying to get property 'headers' of non-object Middleware\VerifyCsrfToken.php
    • PHP Fatal error: Uncaught Error: Call to undefined function mcrypt_encrypt()
    • General error: 1390 Prepared statement contains too many placeholders
    • The media must not be greater than 12288 kilobytes in laravel
    • php undefined index meaNING
    • laravel-migration-error-syntax-error-or-access-violation-1071-specified-key-wa
    • trying to get property 'id' of non object in laravel api
    • Tests\Feature\BlogTest > user can delete post 162 Illuminate\Encryption\MissingAppKeyException No application encryption key has been specified.
    • ERROR: `phpize' failed
    • Syntax error or access violation: 1071 La clé est trop longue. Longueur maximale: 1000"
    • undefined reference to
    • call to a member function get_results() on null
    • Allowed memory size of 33554432 bytes exhausted (tried to allocate 8192 bytes)
    • Invalid argument supplied for foreach() in C
    • [ERROR] InvalidArgumentException: Wrong file in C:\xampp\htdocs\magento2.4\lib\internal\Magento\Framework\Image\Adapter\Gd2.php:64 Stack trace
    • In Connection.php line 1262: Class 'PDO' not found
    • magento2 move Exception #0 (Exception): Notice: Undefined offset: 2 in /var/www/nucleus/htdocs/vendor/magento/framework/Encryption/Encryptor.php on line 591
    • PHP Parse error: syntax error, unexpected '

      [Solved]: PHP heredoc syntax error, unexpected end of file

        John Mwaniki /   01 Jan 2022

      Heredoc syntax is one of the four ways of defining a string in PHP, unexpected $end in. It behaves and works like the double-quotes apart from different syntax and is being used mostly for multi-line strings.

      A string with this syntax begins with triple angle brackets "<<<" followed by a delimiter identifier which can be any text of your choice. This is then immediately followed by a newline.

      The actual string value then follows which can be a single or multiple lines of text.

      The same delimiter identifier follows again in a newline immediately followed by a semi-colon (;) to mark the end of the string.

      Example

      However, you may experience the error below:

      PHP Parse error: syntax error, unexpected end of file, expecting variable (T_VARIABLE) or heredoc end (T_END_HEREDOC) unexpected $end in ${ (T_DOLLAR_OPEN_CURLY_BRACES) or {$ (T_CURLY_OPEN) in /path/to/file/filename.php on line X

      or

      PHP Parse error: syntax error, unexpected end of file in /path/to/file/filename.php

      or when editing the file in cPanel file editor, the error may be highlighted as below:

      Syntax error, unexpected $EOF

      The reason why this error occurs is having a space either before or syntax error the closing delimiter identifier, syntax error. For instance, in our example above, you should ensure that there is no space before or after "ANYTEXT;".

      Example

      Ensure that there is no space at the places labeled with "[space]" and this should solve it.

      Note: The milter drweb-filter to error state syntax error identifier must be alone in a newline followed by a semi-colon (;) and with no whitespace before or after it.

      The nowdoc syntax is very similar to the heredoc, only that its delimiter is application error 1000 1c in single quotes, unexpected $end in. In case you experience the unexpected end of file error with the nowdoc syntax, the solution will be the same as that of heredoc.

      PHP Parse error: syntax error, unexpected $end

      HostGator is committed to making it easy to transfer your site to your new hosting account, unexpected $end in. We can transfer website files, databases, scripts, and one free domain registration transfer.

      What qualifies me for a free transfer?

      HostGator provides free transfers for new accounts within 30 days of sign-up, unexpected $end in, and to newly upgraded accounts. For upgraded accounts it must be an inter-server upgrade to qualify. Please note that downgraded accounts do not qualify for free transfers.

      Depending on which type of account you sign up for, we offer differing numbers of free transfers, unexpected $end in. Please refer to the chart below to see what we include for new packages.

      Full cPanel Transfers is the number of cPanel to cPanel transfers that are included.

      Max. Manual Transfers is the maximum number of Manual Transfers that are included with your account.

      Total Free Transfers is the total number websites that we will move for you.

      Account TypeTotal Free TransfersFull cPanel TransfersMax. Manual Transfers
      ?Shared1121
      ?Reseller3030230
      ?VPSUnlimited1Unlimited210 per VPS level
      ?Dedicated (Basic)Unlimited1Unlimited275
      ?Dedicated (Standard, Elite, syntax error, Pro)Unlimited1Unlimited2100

      1While we can do unlimited cPanel to cPanel transfers for you, unexpected $end in, depending on your account, you will have a limited number of Manual Transfers.

      2Full cPanel transfers include all domains, Addon Domains, Subdomains, and cPanel settings. This will also include your emails and email accounts. Please note that this does require that your old host's cPanel backup generator to be active.

      A few examples: An Aluminium Reseller account includes up to 30 free transfers, unexpected $end in. Out of this 30, you can have 20 cPanel to cPanel transfers and 10 Manual Transfers, or any combination of the two that totals 30 or less websites, syntax error. Another example: A Pro Dedicated server includes unlimited cPanel to cPanel transfers, syntax error, this means you can have 150 sites (or even more) moved. Also since there is an unlimited total number of transfers, you can utilize unexpected $end in to 100 Manual Transfers.

      For more information please see ourTransfers Support Article, contact our transfers department at [email protected], or call 866.96.GATOR

      ', syntax error, expecting variable (T_VARIABLE) in /usr/share/php/Composer/IO/BaseIO.php on line 163
    • violation: 1071 Specified key was too long; max key length is 1000 bytes
    • Parse error</b>: syntax error, unexpected ':', expecting ';' or '{' in <b>//twilio-php-master/src/Twilio/autoload.php</b> on line <b>61</b><br />
    • php undefined offset
    • php RFC3339
    • laravel project composer [ErrorException] Undefined index: name
    • In PackageManifest.php line 122: Undefined index: name
    • magento Fatal error: Allowed memory size of 134217728 bytes exhausted
    • strpos() expects parameter 1 to be string, unexpected $end in, object given
    • Warning: password_verify() expects parameter 2 to be string, syntax error, array given in
    • PHP Notice: Trying to get property of non-object
    • undefined index / error reporting in php
    • laravel create token Trying to get property 'id' of non-object
    • Call to a member function move() on null
    • Unsupported type passed
    • Syntax error or access violation: 1072 Key column doesnt exist in table laravel migrate
    • ErrorException Undefined index(laravel 7 array helpers)
    • expression is not allowed as parameter
    • prevent undefined offset php
    • Warning: Undefined array key "index_no" in C:\xampp\htdocs\true\student\reports.php on line 54 Fatal error: Uncaught TypeError: mysqli_fetch_array():
    • PHP strcspn — Find length of initial segment not matching mask
    • option to have array in function parameter
    • PHP Parse error: Unexpected character "" (ASCII 22) on line 1
    • warning: parameter 2 to search_by_title() expected to be a reference, value given in
    • tcpdf Array and string offset access syntax with curly braces is deprecated
    • Array and string offset access syntax with curly braces is no longer supported in /home/southsah/public_html/wp-content/install.php on line 259
    • Variable "$id" is not defined by operation "GetPost".
    • in packagemanifest.php line 131 undefined index name
    • php notice: trying to access array offset on value of type bool in /usr/share/php/pear/rest.php on line 187
    • syntax error, unexpected variable "$result" in D:\wordpress\xampp\htdocs\templete\user_delete.php on line 13
    • undefined type excel
    • [email protected]
    • Deprecated: Implicit conversion from float
    • mysqli_fetch_array() expects parameter 1 to be mysqli_result, bool given in C:\xampp\htdocs\Job Verification\login\result.php on line 38
    • Illuminate\Database\QueryException SQLSTATE[HY000]: General error: 3780 Referencing column
    • Declaration of App\Exports\TarefasExport::headings() must be compatible with Maatwebsite\Excel\Concerns\WithHeadings::headings(): array
    • No match for argument: phpmyadmin yum
    • Argument 2 passed to App\Exceptions\Handler::unauthenticated() must be an instance of App\Exceptions\AuthenticationException, instance of Illuminate\Auth\AuthenticationException given
    • mod_fcgid: stderr: PHP Fatal error: Maximum execution time of 0 seconds exceeded in /home/circusconcepts/public_html/shop/system/library/PHPExcel/Shared/String.php on line 576
    • How can I Check in PHP if an assosiative array's Index is in Sequence or Not, win32 last error is 14001 Raise an Exception if the IndexedArray is Not in sequence
    • Uncaught Error: Call to a member function query() on null in C:\xampp\htdocs\leadcust\update.php:169 Stack trace: #0 {main} thrown in
    • Schema::defaultStringLength(199);
    • instagram api error
    • TypeError: Argument 1 passed to Drupal\Core\Entity\EntityViewBuilder::view() must implement interface
    • 1048 Column 'user_id' cannot be null when trying to assign role to existing user Laravel
    • exceptions on fatals(2)
    • Parse error: syntax error, unexpected $end in 'if' (T_IF) in /opt/lampp/htdocs/testphp.php on line 30
    • Undefined variable $argc $argv in PHP
    • connection succesfullyDatabase 'school' selected Fatal error: Uncaught Error: Call to undefined function mysqli_errorno() in C:\xampp\htdocs\dbconn\send.php:30 Stack trace: #0 {main} thrown in C:\xampp\htdocs\dbconn\send.php on line 30
    • Argument #1 ($baseObject) must be of type DateTimeInterface, unexpected $end in, string given
    • Parse error: syntax error, unexpected token "=", expecting ";" in C:\xampp\htdocs
    • Required parameter follows optional parameter (500 Internal Server Syntax error php
    • laravel sendgrid using 2 unexpected $end in authenticators. Authenticator LOGIN returned Expected response code 250
    • unexpected variable
    • how to fix Column not found: 1054 Unknown column 'api_token' in 'where clause' (SQL: select * from `users` where `api_token laravel
    • Argument 1 passed to Illuminate\Database\Grammar::parameterize()
    • Parse error: syntax error, unexpected $end in, unexpected 'location' (T_STRING) in C:\xampp\htdocs\loginsystem\login.php on line 23
    • illuminate routing array to string conversion
    • Call to undefined function get_plugin_data()
    • codeception field datetime firefox
    • encode string unexpected $end in csv
    • PHP 7 - Fatal error: Call to undefined method PDF::FPDF()
    • php I don't succeed in passing information (object) using Ajax (Jquery)
    • php iterate through objects
    • undefined variable require_once
    • laravel public ParseError syntax error, unexpected $end in, cannot boot from cd error 5 '$conversion' (T_VARIABLE), syntax error, expecting ',' or ')' /
    • Uncaught TypeError: call_user_func(): Argument #1
    • undefined offset: 7 in d:\xamp\htdocs\php\function\function.php on line 137
    • In PackageManifest.php line 131: unexpected $end in unexpected $end in Undefined index: name
    • Symfony Expected argument of type "string", unexpected $end in, "null" given
    • mysqli_fetch_all() expects parameter 1 to be mysqli_result, boolean given in C:\xampp\htdocs\complete-blog-php\admin\includes\post_functions.php on line 31
    • Argument 1 passed to Doctrine\Inflector\Inflector::singularize() must be of the type string, null given,
    • Parse error: syntax error, unexpected token "implements" in C:\xampp\htdocs\master\vendor\yiisoft\yii2\base\Object.php on line 78
    • An expression was expected phpmyadmin
    • Notice: Trying to get property 'name' of non-object in
    • Expected response code 250 but got code "530", with message "530 Must issue a STARTTLS command first. "
    • swift mailer 530 Must issue a STARTTLS command first.
    • mysqli_query() expects parameter 1 to be mysqli, string given
    • Notice: Trying to access array offset on value of type bool in /usr/www/users/easygrb/storage/modification/catalog/controller/startup/startup.php on line 169
    • Syntax error or access violation: 1055
    • Warning: Undefined array key "playerthrows" in C:\xampp\htdocs\mini_projet\index.php on line 10
    • "message": "Call to a member function canNot() on null", "exception": "Symfony\\Component\\Debug\\Exception\\FatalThrowableError",
    • php detect request type
    • php redirect in seconds
    • add sucssess message laravel
    • php remove file
    • laravel command to create symlink storage
    • php console log
    • 'cross-env' is not recognized as an internal or external command, laravel
    • wordpress if thumbnail show else
    • php artisan php warning require
    • php random string generator
    • php does property exist
    • php get user ip
    • php is object
    • php encode url fatal io error 104 mysql datetime
    • php append to array
    • for loop php
    • php get size of file
    • php switch
    • how to connect to a database in php
    • php sort multidimensional array
    • php sleep half a second
    • php remove last character from string
    • regex for email php
    • laravel please provide a valid cache path
    • laravel migration on delete set null
    • insert rows in migrations laravel
    • php explode
    • php check if string or number
    • php replace
    • laravel get input from request
    • codeigniter count rows
    • php convert object to array
    • remove repeated columns laravel
    • laravel generate unique token
    • laravel loop through collection
    • php if divisible by 30
    • print url in view yii2
    • how to add title to wordpress php
    • laravel check record exists
    • check if user has role twig
    • search on taxonomy wordpress query
    • php delete element from array
    • parametre grouping laravel quert
    • carbon months between dates
    • php json_encode
    • php curl example
    • php expire a session
    • laravel composer update
    • php get first element of array
    • laravel include with variable
    • laravel subtract date
    • php date object to timestamp
    • Line : 83 -- syntax error, unexpected end of file php
    • wordpress add to cart redirect php
    • php float value
    • laravel convert eloquent collection to collection
    • export PATH=/Applications/MAMP/bin/php/php5.4.10/bin:$PATH
    • php get day of week
    • php secure password hash
    • set a minimum character value in php
    • laravel pagination vuetify
    • laravel set field unique
    • php proper function comments
    • laravel database seeder
    • read xml file in php wordpress
    • execute function php
    • php pdo sql server connect
    • laravel import xml to database
    • laravel check if api request
    • Corsair K70 RGB MK.2
    • install a package only composer syntax error update
    • Override the route parameter names
    • send data with url in php
    • findOneBy
    • symfony user online
    • https://stackoverflow.com/questions/34545641/php-artisan-makeauth-command-is-not-defined
    • can't see php7 in my mac
    • textarea autocomplete phpmyadmin style
    • laravel sintax
    • How to check if fwrite failed php
    • changing the autoload.php for algolia search
    • php elseif
    • php sessions
    • install phpmyadmin ubuntu
    • run php dev server
    • run php server
    • php console log
    • try catch php
    • how to connect to a database in php
    • php mysql connect
    • hash a password php
    • php registration form with file upload free download
    • basic code for file upload in php
    • install php 7.4 on ubuntu 20.04
    • php file exist
    • show php configuration
    • show php info
    • php configuration
    • how to debug php
    • php header location
    • php header
    • checking php version
    • ubuntu 20 unexpected $end in install
    • create session in php
    • php how to delete file
    • php comment supprimer un fichier
    • php remove file
    • php delete session
    • how to get ip address of client using php
    • php reload current page









    Register to vote on and add code examples, unexpected $end in. Join our developer community to improve your dev skills and code like a boss! pci toshiba g40 error
    Help us improve our code examples by registering to vote on and add answers. Join our developer community to improve your dev skills and code like a boss!


    By continuing, syntax error, I agree that I have read and agree to Greppers's Terms of Service and Privacy Policy.

    Parse Error in PHP (!) syntax error unexpected end of file

    PHP will took your programming to another peak, some of them enjoyed and some feel confused. But when you are testing the output result which occurs an error like Parse Error: Syntax Error. All the output goes away. One of the common programming error in PHP is mentioned below every beginner/expert got this error.

    “( ! ) Parse error: syntax error, unexpected $end in C:wampwwwprojectnamefilename.php on line any-line-number”

    What is the solutions for that ? usually unexpected end of file $end occurs when you forgot the curli bracket at the end like if you write

    <?php
    if ( $abc ==1){
    ?>
    <h1>Parse error: syntax error check</h1>

    Now you can clearly see you forgot syntax error Bracket } because if condition is not closed properly. you code should be like this

    <?php
    if ( $abc ==1){
    ?>
    <h1>Parse error: syntax error error check</h1>
    <?php } ?>

    Other expected problems are listed below i explain 2nd point above in example.

    • Parse error or syntax error occurs when you missed bracket ( } ) at the end.
    • When you write if condition and forgot the parenthesis ) - syntax error. <?php if (isset($A){
      echo "parse error: syntax error will happen ";
      }

      Now see you forgot ) before { because you open two parenthesis before isset and after isset and you close single parenthesis.

    • At the end of line Forgot the Semicolon ( ; ).
    • Check every comma because you declare array and forgot Comma ( , ).
    • Concatenation error suppose if you echo two variable without Concatenation Dot ( . ).

    Hope this will solve your problem if any other errors occurs then write a comment. we are here to help you.

  • 1 Comments

    Leave a Comment