Runtime error 216 usd

runtime error 216 usd

Check for your manifest and try again. It should be as below: youtube video How To Fix Run Time Error On Windows 10

Runtime error 216 usd - have hit

Currency field makes dump when I wrote something on ALV.

Hi gurus!

I just faced a problem with ALV.

I'm using source code as below.

The point is blue one.

When I add a row and write something on 'ZINVAMT' field with 'CFIELDNAME' and press enter, dump occurs.

And when I use 'CURRENCY', dump is not occrued.

I'm using

CALL METHOD g_grid->refresh_table_display.

method after add a row.

Thanks for your reply.

Field Catalog code

PERFORM fill_field_category_detail USING :

'S' 'FIELDNAME' 'ZINVAMT',

' ' 'COLTEXT' 'INV. AMT',

* ' ' 'REF_TABLE' 'ZMM223',

* ' ' 'REF_FIELD' 'ZINVAMT',

' ' 'EDIT' 'X',

* ' ' 'CFIELDNAME' 'ZWAERS',

* ' ' 'CURRENCY' 'USD',

'E' 'OUTPUTLEN' '11',

FORM fill_field_category_detail USING :

DATA l_col(40).
FIELD-SYMBOLS <fs>.
CONCATENATE 'GS_FCAT-' p_fname INTO l_col.
ASSIGN (l_col) TO <fs>.
MOVE p_con TO <fs>.

IF p_gub = 'E'.
APPEND gs_fcat TO gt_fieldcat.
ENDIF.

error message

Runtime Errors GETWA_NOT_ASSIGNED

Error in the ABAP Application Program

The current ABAP program "CL_GUI_ALV_GRID===============CP" had to be
terminated because it has
come across a statement that unfortunately cannot be executed.

You attempted to access an unassigned field symbol
(data segment 32782).

This error may occur if
- You address a typed field symbol before it has been set with
ASSIGN
- You address a field symbol that pointed to the line of an
internal table that was deleted
- You address a field symbol that was previously reset using
UNASSIGN or that pointed to a local field that no
longer exists
- You address a global function interface, although the
respective function module is not active - that is, is
not in the list of active calls. The list of active calls
can be taken from this short dump.

If the error occures in a non-modified SAP program, you may be able to
find an interim solution in an SAP Note.
If you have access to SAP Notes, carry out a search with the following
keywords:

"GETWA_NOT_ASSIGNED" " "
"CL_GUI_ALV_GRID===============CP" or "CL_GUI_ALV_GRID===============CM03B"
"SPLIT_GOOD_AND_BAD"

If you cannot solve the problem yourself and want to send an error
notification to SAP, include the following information:

1. The description of the current problem (short dump)

To save the description, choose "System->List->Save->Local File
(Unconverted)".

2. Corresponding system log

Display the system log by calling transaction SM21.
Restrict the time interval to 10 minutes before and five minutes
after the short dump. Then choose "System->List->Save->Local File
(Unconverted)".

3. If the problem occurs in a problem of your own or a modified SAP
program: The source code of the program
In the editor, choose "Utilities->More
Utilities->Upload/Download->Download".

4. Details about the conditions under which the error occurred or which
actions and input led to the error.

209

210 * If field has not DDIC referencen

211 if ls_fieldcat-ref_table is initial.

212 *-- Formal field check without DDIC reference

>>>>> call method me->formal_field_check_no_ddic

214 exporting

215 i_currency = <l_currency>

216 i_value = ls_cells-value

217 i_row_id = ls_cells-row_id

218 i_tabix = l_tabix

219 is_fieldcat = ls_fieldcat

220 importing

221 eflg_invalid = eflg_invalid

222 changing

223 c_field = <l_field>

224 ct_good_cells = et_good_cells

225 ct_mod_cells = et_mod_cells.

Error 5 when you try to start the Windows Installer service

  • 0xd0000022:0xd0000022 error code when you try to start the software Liscensing service

    I installed Vista Home Premium on my system there is no problem. Activated and it worked very well. A few days ago arrested updates installation error 0 x 80070426. According to Microsoft Answers, I tried to restart the service 'Software Liscensing' for some reason any that he had stopped. When the service tries to start, I get error code 0xd0000022:0xd0000022 and the service is not started. Help, please. I have a copy genuine Windows Vista Home Premium and the original product key.

    Please repost your request in Forum Windows Vista Validation issues .  Thank you!

  • Error 1068 when you try to start the WIA service after the installation of the W7 SP1

    Original title; Error 1068 when you try to start the WIA service after the installation of the W7 SP1. The scaner to my Epson Workforce 633 all-in-One printer does not work after that.

    SCANeR to my Epson Workforce 633 all-in-One printer does not work after the installation of the W7 SP1. I contacted Epson support and they told me I had to contact MS support to get help this isue. The problem is that something is not letting the WIA service to start and I am getting error 1068 when you try to start the WIA service.

    Hello

    Method 1: Try to uninstall and reinstall Epson drivers and related software.

    Visit our articles to do the same below:
    http://Windows.Microsoft.com/en-us/Windows7/uninstall-or-change-a-program
    http://Windows.Microsoft.com/en-us/Windows7/install-a-program

    Method 2: Also scan SFC (System File Checker) on the computer.
    http://support.Microsoft.com/kb/929833

    Hope this information helps.

  • Error: 0 x 80070424 "cannot start the Windows Security Center service" when you try to start the Windows Security Center Service.

    original title: Error Code 0 x 80070424 on the Windows Firewall settings

    I can't turn on my Security Center Windows Service, when I try to turn it on it displays "cannot start service Security Center Windows"

    Then when I go to my firewall settings, it says "Windows Firewall don't use recommended settings to help protect your computer" I click "Use recommended settings" but it displays "Windows Firewall cannot change some of your settings 0 x 80070424 error code" how to fix this?

    Hello

    Make sure that the PC is clean (free from zero rootkit to access before you try this corrected)

    This problem of firewall is commonly found on vista and windows 7 (64 BIT OS)

    Download the two files from the registry

    http://download.bleepingcomputer.com/win-services/7/Mpssvc.reg

    The base filtering engine

    http://download.bleepingcomputer.com/win-services/7/BFE.reg

    Run them and click YES when you receive a UAC prompt

    Restart your PC

    Press Windows key + R and type

    regedit , and then click ok

    Reach

    HKEY_LOCAL_MACHINE\SYSTEM\CurrentControlSet\services\BFE

    Right click on it -permissions

    Click ADD and type

    Everyone, and then click ok

    Now click on all

    Below, you have the permission for users

    Select full control, and then click ok

    Press Windows key + R and type

    services.msc , and then click ok

    Start the service database and then filtering engine service windows firewall

    If you still get this error

    Windows could not start the Windows Firewall on the local computer. See the event log, if services not windows contact from the seller. Error code 5.

    Download and launch this key

    Shared access

    Click YES when you receive a UAC prompt

    Reach

    HKEY_LOCAL_MACHINE\SYSTEM\CurrentControlSet\services\SharedAccess

    Right-click on -permissions

    Click Add and type

    Select full control and everyone

    You should be able to start right now the firewall

    You can also Miss defender of windows security center, BITS and windows update services

    Download

    Security Center service

    http://download.bleepingcomputer.com/win-services/7/wscsvc.reg

    Windows Defender

    http://download.bleepingcomputer.com/win-services/7/WinDefend.reg

    BITS

    http://download.bleepingcomputer.com/win-services/7/bits.reg

    Windows Update

    http://download.bleepingcomputer.com/win-services/7/wuauserv.reg

    Run them and click YES when you receive a quick restart, UAC the PC

    Good luck

    * Edit *.

    Change the settings of the REGISTRY can cause serious problems that may prevent your computer from starting properly. Microsoft cannot guarantee that problems resulting from the REGISTRY settings configuration can be solved. Changes to these settings are at your own risk...

  • BlackBerry Smartphones-error message when you try to start the Media Manager.

    I have a BlackBerry Curve 8310. I installed the software of BlackBerry Desktop Manager ver.4.2.2. Roxio Media Manager 9 is included in the software of BB.

    When I try to run Media Manager, I get the error message:

    Runtime error!

    Program: C:\Program Roxio Manager 9\MediaManager9.exe

    This application has requested the execution in an unusual way.
    For more information, contact the application support team.

    I tried to reinstall the software. I always get the same error message.

    Does anyone have any suggestions I can try.

    I don't have or don't want the BB package which comes from my carrier (AT & T), I just want to be able to download and upload photos from my desktop to my BB. My children send me text messages that contain pictures of my grandchildren I want to save.

    Thanks for your help.

    Ed Wood

    Hello

    you don't need Roxio just to move the images, just use your Blackberry as a USD external memory card reader.

  • Error: 6 when you try to start the PS CS5.1 after reset of the HD

    The error message also tells me to reinstall the application.

    I downloaded the software from Adobe.com

    At the opening of the dmg I get a regular disk for Adobe Photoshop CS5\ image

    Trying to go ahead and click on the setup I get this message

    Screen Shot 2016-04-28 at 11.18.06.png

    any help, please?

    Moving to download, installation, setting up

  • -Error 1068: when I try to start the "Windows"(Windows XP Pro). Search Service ".

    I get an error 1068 and the service cannot be started. My PC is slow to find things and start. How to go beyond this error and get my indexing job?

    I checked and installed all windows updates for all my software from microsoft.

    Jim

    {7D096C5F-AC08-4F1F-BEB7-5C22C517CE39} = Manager of Windows search.

    It is quite all right, but you have a virus / malware infestation the or about July 7, 2011. Malware will address management tools such as event viewer and the Task Manager.

    You might have been able to resolve the problem by using the system restore, but very probably will have passed too much time for you to have a restore point before the alleged infestation. What you have with a Windows XP CD? I suspect that you need to do a repair installation and for this you need an original CD. If it's a branded computer which includes most laptops, this will be a restore to factory settings after you back up your data files.

  • The internal error message when you try to download the windows OS for Palm.

    Whenever I try to download from a disk or download from the site of Palm, the palm operating system, I get a message saying "Internal error 2738" and he won't let the software load. I'm stuck and can't do anything. Help, please. Thank you.

    Using a search engine, I found this answer in a few seconds...

    http://forums.support.Roxio.com/index.php?showtopic=19110

    WyreNut

  • 0x800703E7 error code when you try to upgrade to Windows XP Service pack 3

    where updates seeks to install XP Service pack 3 error code 0x800703E7 takes place and will find load Service pack 3

    It's a blue screen or it appears in the window?

    What antivirus do you use?

    Is what kind of computer?

    you installed service packs earlier?

  • "WindowsUpdate_80070641" "WindowsUpdate_dt000"_"WindowsUpdate_00000641" "WindowsUpdate_dt000" __Windows could not start the Windows Installer service on computer local error 216:0xd8

    I have a 64 bit Windows 7 PC and cannot install updates.  Here are two screenshots.

    One contains two error message that I get when trying to update

    "WindowsUpdate_80070641" "WindowsUpdate_dt000"
    "WindowsUpdate_00000641" "WindowsUpdate_dt000"

    The second erorr is what I get when you try to start the Windows Installer Service.

    Windows cannot start the Windows Installer service on computer local error 216:0xd8

    I follow several steps that are listed in the web pages of solving problems.  Tried to make own reboots, use the Microsoft Fix and it does not detect any problems.  I tried to install Windows Installer 4.5 and I get a message telling me that this update is not applicable to your computer

    Please notify

    See if this ad helps-

    http://social.answers.Microsoft.com/forums/en-us/vistawu/thread/213770d0-e94b-43B4-9ff6-99e6366b556b

    TaurArian [MVP] 2005-2011. The information has been provided * being * with no guarantee or warranty.

  • Receive error message when you try to download the update update for PowerPoint 2003 (KB957784) security

    I still receive an error message when you try to download the update to update security for Microsoft PowerPoint (KB957784).

    I searched night and day for a solution - even contacted microsoft by e-mail.  The specific error is: Code 57F

    It is displayed when I press the "get help with this error message:
    "WindowsUpdate_0000057E" "WindowsUpdate_dt000"

    It was the E-mail feedback:

    Thank you for your email about problems with the download of update of security for Microsoft PowerPoint.

    I understand your concern. Due to the nature of the technical issue, it was not possible for me to respond to your request. There are number of ways you can get technical information to our support team.

    MowGreen-
    Understood the factor of masking - has considered it.  Still, I send my appreciation in this matter.  I would like to know if you think I should download the SP2 for Vista.

    Peace-
    Matt

    Service Pack 2 offered by Windows (automatic) update yet?

    Windows Vista and Windows Server 2008 service Pack is not available for installation from Windows Update and automatic updates does not offer

    Cause
    This problem can occur for different reasons. However, the following reasons are the most common:

    • Already, you have the service pack installed and do not realize it.
    • You must install another update before you install the service pack.
    • You have not installed Service Pack 1 (SP1) and so you are not offered the option to install the Service Pack 2 (SP2). SP2 requires that you have installed SP1.
    • Components of the system that you must have to install the service pack are not installed on your computer.
    • You have a piece of hardware or software on your computer that is listed in the section "hardware and software which if present will result in Windows Update and automatic updates offers is not a service pack " article.
    • You have installed a preliminary version of a service pack, and it was not properly uninstalled before that you tried to install the final version of the service pack

    Service Pack 2 for Windows Vista and Windows Server 2008 is not available to users for which the following update is hidden:

    955430 description of the Windows Vista and Windows Server 2008 installation feature software update released April 28, 2009

    See article KB, Matt. When the system is ready for SP2 [as in you will be informed of the automatic update], suggest then you download the full SP2 package, save, temporarily disable AVG and then install SP2.
    The MS KB article below has sound advice for steps, you have to take before installing a Service Pack

    What you need to know before you install Service Pack 1

    Microsoft offers support without charge to get SP2 installed or for the resolution of problems that arise after he installation

    Start here - free support for Windows Vista service pack problems

    If a problem occurs, you can also solve problems installing yourself-
    How to troubleshoot Windows Vista and Windows Server 2008 service pack installation issues

    MowGreen MVP Data Center Management - update of safety Consumer Services

  • When you try to print the document his service hence giving error does not

    I am using windows xp pro sp2

    When you try to print the document his service hence giving error does not

    then I start the services.msc print spooler service, but this only works for printing after that it gave the same error

    Please help me

    Hi kalpesh_vaghela,

    1. Did you the latest changes on the computer?
    2. What is the full error message that you receive?
    3. What is the number and model of the printer?
    4. You use any program to print the document?
    5. Are you experiencing a similar problem with any program that allows you to print?
    6. You have security software installed on the computer?

    Method 1

    See the link below and try the fixit tool available, check if it helps.

    Problems printing and printing errors

    http://support.Microsoft.com/mats/printing_problems/

    Method 2

    If the previous step fails, then it is possible that some third-party programs installed on the computer is causing the problem.

    I suggest that you configure the computer in a clean boot state and check if it helps.

    To help resolve the error and other messages, you can start Windows XP by using a minimal set of drivers and startup programs. This type of boot is known as a "clean boot". A clean boot helps eliminate software conflicts.

    See section to learn more about how to clean boot.

    How to configure Windows XP to start in a "clean boot" State

    http://support.Microsoft.com/kb/310353

    Reset the computer to start as usual

    When you are finished troubleshooting, follow these steps to reset the computer to start as usual:

    1. Click Start , and then click run.
    2. Type msconfig , and then click OK.
      The System Configuration utility dialog box appears.
    3. Click the general tab, click Normal Startup - load all device drivers and services , and then click OK.

    When you are prompted, click restart to restart the computer.

  • (Windows Vista Home Premium) 800b0100 error code when you try to install the two (KB978338) and (KB968389)

    (Windows Vista Home Premium) 800b0100 error code when you try to install the two (KB978338) and (KB968389)

    I tried all the recommended solutions that Windows can throw at me, and yet I still can't download these updates for some reason any. Whenever I run the program "Microsoft Fixit" he says it's a mistake and fixing it with success, but I still get the same error when you try to install the updates. I have checked for malware, scanning my computer everything and see nothing.

    Hello

    1. what troubleshooting steps are carried out to solve the problem?

    2 were there any hardware or software changes made on the computer before this problem?

    Method 1:

    I suggest you to return the item and check if it helps:

    Problems with installing updates

    http://Windows.Microsoft.com/en-us/Windows-Vista/troubleshoot-problems-with-installing-updates

    Method 2:

    Check out the link and check if it works:

    Windows Update error 800b0100

    http://Windows.Microsoft.com/en-us/Windows-Vista/Windows-Update-error-800B0100

    Method 3:

    I suggest to put the computer in a clean boot state and then try to open the program and check if it helps.

    Note When you perform a clean boot, you may temporarily lose some functionality. When you start the computer as usual, the function returns. However, you may receive the error message, or you can experience the original behavior.

    How to solve the problem by running the clean boot in Windows Vista:
    http://support.Microsoft.com/kb/929135

    Note: Once you have completed troubleshooting, perform the steps in the step 7: to reset the computer as usual.

    Reference:

    You can download updates manually from the link below:

    http://www.Microsoft.com/downloads/en/default.aspx

    It will be useful.

  • CASE policy Error Message When you try to install the driver for Kodak esp 5250

    I get the error message "Manager policy of Microsoft .net framework case has stopped working" when you try to start the installation of the 5 Series Driver Pack. Tried all the Basic .net troubleshooting I found on the net. Get the option debug or close the program. After clicking Close the program, I get the error message "installation printer Kodak has stopped working". Any ideas? Advice? More info needed? Vista SP 2.

    Hi MC_JP,

    Users faced with a similar question solved this problem by installing Microsoft .NET Framework 3.5 Service Pack 1.

    Step 1: I you suggest to download and install Microsoft .NET Framework 3.5 Service Pack 1 from the following link and then try the printer driver

    http://www.Microsoft.com/downloads/details.aspx?FamilyId=AB99342F-5D1A-413D-8319-81DA479AB0D7&displaylang=en

    Step 2: Put the computer in a clean boot and installation of the printer driver

    Follow step 1 in the link below,

    How to troubleshoot a problem by performing a clean boot in Windows Vista or in Windows 7

    http://support.Microsoft.com/kb/929135

    Important: n ' forget not the computer to start normal follow step 7 in the link.

    Kodak printer drivers

    http://www.kodak.com/global/mul/service/downloads/DownloadLookup.jhtml?PQ-path=15506&product=EKN036744

    Thank you, and in what concerns:

    Ajay K

    Microsoft Answers Support Engineer

    Visit our Microsoft answers feedback Forum and let us know what you think.

  • Just recently, I receive the following error message when you try to access the web sites. I get a pop-up window indicating "Exc in ev handl: TypeError: c.location is null" then I have to click ok. There is a problem with some plugin?

    Just recently, I receive the following error message when you try to access the web sites. I use Firefox browser version 10.0.2. I get a pop-up window indicating "Exc in ev handl: TypeError: c.location is null" as the web site page is displayed in the browser winder. So, I have to click ok. Any link/website I go to what happens. There is a problem with some plugin?

    It is only a problem for the SiteAdvisor users who are still on 3.4. This problem is resolved in the latest version of SiteAdvisor, which is 3.4.1.195. Go to http://siteadvisor.com and click on download. This will fix the problem.

    Meanwhile, SiteAdvisor team will push down a JS update in the coming days 1-2 to automatically resolve this problem in version 3.4.

  • Questions tagged [runtime-error]

    Use this tag to indicate that when an application is run, it reports a runtime error or runtime exception after or during the execution of the application. Use this tag with other tags that indicate programming language being used ([java], [c++], etc.) or for standard utilities or development environments include a tag indicating the application being run ([maven], [visual-studio], [gcc], etc.).

    0votes

    1answer

    206views

    Debugging errors that were not caught by Application_Error()

    I have an MVC3 (C#) application that threw up a mysterious error (displaying a custom error page) that I didn't have found any information about it in both my log file (I use NLog for logging) and IIS ...

    0votes

    0answers

    590views

    PEAR::Mail Notice Strict Standards error

    Installed PEAR Mail library and really like how it works, much better than PHP mail() function. However, I'm getting the strict standards notices showing up in the error_log with every mail sent. ...

    0votes

    2answers

    1kviews

    How I can fix this message with my applet?

    I have an error when I run my Applet: Ignored exception: java.lang.RuntimeException: java.lang.ExceptionInInitializerError Ignored exception: java.lang.RuntimeException: java.lang....

    0votes

    0answers

    920views

    Why am I getting an HRESULT 0x800A03EC Exception when using Range.AddComment

    I can't seem to find a question about this error in the context of Range.AddComment I am using code that goes through a selected row and adds comments to each cell. Sometimes it will write a comment ...

    0votes

    1answer

    461views

    Connection error in java website. Tnsping shows that the service is running

    I have a java website application running in windows 7 which uses oracle database for its functionalities. The database has default SID name orcl. When I use tnsping, I can see that the orcl service ...

    0votes

    1answer

    237views

    error pressing key programmatically

    I have a C# application and an embedded browser in it; its task is to go to my web site and right click on a link and press 'r' so the properties window appears (I move the mouse with code). It works ...

    0votes

    1answer

    4kviews

    Java Applets Not Loading; "Start: App Not Initialized"

    I don't quite get this. I downloaded a class, put it on my website, and then created an HTML page with the basic applet tags, and the app showed up just fine. But when I downloaded the source code ...

    0votes

    1answer

    939views

    Eclipse Android Runtime Errors

    Currently working on a Android application for delivery drivers. Its been working fine for months but now it suddenly force quits when 'submit' button is pressed. Whilst debugging its given me all ...

    0votes

    1answer

    349views

    Runtime Error : NZEC

    I keep getting a runtime error on my submission to the problem at http://www.codechef.com/problems/LASTDIG. My code is as follows : public class Main { public static void main(String[] args) { ...

    0votes

    1answer

    1kviews

    fortran 90 allocatable array already allocated on calling type bound procedure

    I am getting this weird runtype error in my fortran code . I have a pointer to a user defined type A as an element of user defined type B. When I call a procedure associated with type A from a ...

    0votes

    1answer

    1kviews

    Getting gnuplot to work in JRuby - "RuntimeError: gnuplot executable not found on path"

    I've installed gnuplot using... jruby -S gem install gnuplot But I get "RuntimeError: gnuplot executable not found on path" when I try to run it using... require 'gnuplot' If I change it so I say....

    0votes

    1answer

    1kviews

    Using A C++ Class In Windows Form Leads to System.AccessViolationException

    I have written a few C++ classes which employ a variety C++ libraries. I made a Windows Form project, and set it up to use my classes successfully. However, I recently made another C++ class and now ...

    0votes

    1answer

    153views

    getting run time errors in android app

    i m new to programming and android. i m making an android app for reading a binary file from sd card and plotting its content on 14 graphs. my code is 534 lines long so i can't post it here. so,given ...

    0votes

    1answer

    215views

    how to clear this error iTextPdf Document error?

    I am getting a The document has no pages. runtime error in this program... public class Windows { public static void main(String[] args) throws FileNotFoundException, DocumentException { ...

    0votes

    1answer

    1kviews

    Calling a xib when custom view is called from xib causes a crash

    In one .xib file I add one view and modify its class to be my CustomViewClass. Inside that class I have the rewriting method which has been called when the .xib is created: - (id)initWithCoder:(...

    0votes

    2answers

    185views

    AVD running in eclipse barely ever runs app

    I'm new to android development and don't currently own an android device so I'm relying on the avd to run my app but it is being highly unpredictable. I'm currently at the stage that I have the menu ...

    0votes

    1answer

    4kviews

    classic asp WScript.Shell run error

    first time post here. I am using classic ASP (vbscript) on a windows 2008 server with IIS7. I am using a command-line utility with the following code: (the dir is not the actual code but used for ...

    0votes

    2answers

    481views

    Flash CS5 AS3 - runtime error with text box

    I get the following runtime error due to my text box: Error: SymbolClassLoader can't find Resource with id = 2, name = 'Cube_Inventory_HUD__LoadingAnimation__' Error: SymbolClassLoader can't find ...

    0votes

    3answers

    4kviews

    how can I run a .exe file through C++?

    My .exe application needs to be opened in console window. Then I have to type the name of a .txt in the console application for it to read. How can I perform all these within my code at once? I used ...

    0votes

    1answer

    198views

    Class mx.core::DesignLayer could not be found

    I am trying to run my Flex project, however on runtime I get the error: VerifyError: Error #1014: Class mx.core::DesignLayer could not be found So I have added an import statement for the Design ...

    0votes

    1answer

    130views

    Runtime error: program has stopped responding

    My program is to calculate the price of resources based on the resources that their neighbors have. It compiles, but at run-time, it breaks and says that the program has stopped responding. Any help ...

    0votes

    1answer

    5kviews

    Excel 2007: "Automation Error" when sorting data using VBA (80010105)

    I'm running a VBA script from an Excel file that opens another file, manipulates data and some charts, then saves it. Everything works perfectly except when I try to sort data. When I get to the ...

    0votes

    1answer

    1kviews

    Unable to Destroy Android Activity on Back button pressed

    03-26 16:16:38.623: E/AndroidRuntime(5079): FATAL EXCEPTION: main 03-26 16:16:38.623: E/AndroidRuntime(5079): java.lang.RuntimeException: Unable to destroy activity {com.crack.Emobi/com.crack.Emobi....

    0votes

    1answer

    417views

    Running Tahiti: Aglet Viewer

    Working on (aglets-2.0.1.zip) I'm trying to run Tahiti and I've got this error. It is as it showing in the picture java.lang.ClassNotFoundException aglet66 How to resolve it?

    0votes

    1answer

    675views

    Runtime-Class cast Exception when compiled the source with Ant script

    I am using ant and jdk-1.5_10 for compiling my source and creating a jar file. And the jar is created without any compilation errors. But I am facing following during run time for the following code - ...

    0votes

    2answers

    5kviews

    Can't Modify Frozen string error

    I run a test and randomly I'll get the error: can't modify frozen String (RuntimeError) This error seems to occur only after a timeout error has happened. Not sure if that means that they are related ...

    0votes

    1answer

    210views

    Runtime error on ItemRenderer in Flex 2

    When I run my Flex 2 app I get the following runtime error: TypeError: Error #1009: No se puede acceder a una propiedad o a un método de una referencia a un objeto nulo. In other words, the Flex ...

    0votes

    1answer

    439views

    "Parser Error" After moving the website to the server

    My website is working totally fine on local host but when I moved the website to the server I couldn't open the website, I got the following error: Parser Error Description: An error occurred during ...

    0votes

    1answer

    346views

    Word VBA: Run-time error 5453.Word has finished searching the document

    I am working on a VBA Macro in Word and among other things I am calling the EditFind Dialog Window. If Word has searched the document more than once and finds what I am searching for, after closing ...

    0votes

    0answers

    38views

    Error when I execute without debug

    I'm programm with vc2008, and I have been develop a direct3d project with this. When I run my project with execute (ctrl+F5) error in meshLoading. But I run my project with debug(F5) it isn't. ...

    0votes

    1answer

    291views

    Java heap space error in parallel program

    I'm measuring the throughput of various parallel data structures. I essentially have various amounts of clients (1-16) performing read or write operations. When I have them perform only 10,000 ...

    0votes

    0answers

    354views

    Code works perfectly on dev c++ but not on gcc 4.3.2

    This code works perfectly on dev but causes a run time error on gcc? Can I know why? This program is used to find minimum iterations to add a number and its reverse continuously until a palindrome is ...

    0votes

    1answer

    492views

    runtime error, but debugging step by step works fine

    I wrote an android program to take a picture without preview. My programs works fine when I debug it step by step. However, when I run it in execution mode, the program doesn't work as expected. No ...

    0votes

    1answer

    2kviews

    Microsoft JScript runtime error: 'getCities' is undefined

    I am Using RadComboBox In UserControll I Want To Bind All The Cities With the CheckBoxes In RadComboBox. For That I Have Written Code As Follows : FOR ASPX :- <script type="text/javascript"> ...

    0votes

    0answers

    582views

    Matlab runtime error for bigger data-arrays passing to mex function

    I wrote a mex function and when I call it for some smaller arrays, everything works fine. When passing a bigger array, I get the following runtime error. http://img192.imageshack.us/img192/6262/...

    0votes

    1answer

    235views

    I'm facing a runtime custom error problem on server

    I'm facing a custom error problem on server.can u plz help me out Runtime Error Description: An application error occurred on the server. The current custom error settings for this application ...

    0votes

    2answers

    1kviews

    Why am I getting CGContext errors when installing an iPhone app?

    Why am I getting the following errors when trying to install my iPhone application? warning: Unable to read symbols for /Library/MobileSubstrate/MobileSubstrate.dylib (file not found). warning: ...

    0votes

    2answers

    10kviews

    Error: "This field name is not known" while opening Crystal reports

    Working on a Migration (VB6 to VB.Net(VS 2005)) application, where some of the reports are loaded in the application. The VB application is using the Crystal reports version 8. While migrating the ...

    0votes

    2answers

    431views

    Django is returning RuntimeError instead of 404

    In my Django project I am having RUntimeError when I'm supposed to get a 404. The description says: Exception Value: maximum recursion depth exceeded The error only occurs when I try to access a ...

    0votes

    1answer

    1kviews

    The BlackBerry Simulator rises a RuntimeException

    I'm trying to run a BlackBerry project using Phonegap. I followed all the steps described here. When I run the project, I get the following error: C:\Users\Admin\Development\eclipse_galileo\plugins\...

    0votes

    1answer

    73views

    Problem building a Java Rules app in Eclipse

    I'm trying to build a simple Drools project in Eclipse, but when I try to test it, a runtime exception is thrown with the message, "The Eclipse JDT Core jar is not in the classpath." Any ideas where ...

    0votes

    1answer

    118views

    Runtime HttpException affecting only one page/usercontrol

    We're having an issue with a .NET 3.5 WebForms site where occasionally our error logs start filling up with the following error message: "Multiple controls with the same ID 'ctl09' were found. ...

    0votes

    1answer

    1kviews

    Error 70 in Excel VBA

    I am trying to upload directly a picture/chart from excel to a Sharepoint group URL. Here is the script: Sub ExportChartJPG() ActiveChart.Export Filename:="http://sharepoint.ap.xxxxxxxxxxxxxx.com/...

    0votes

    2answers

    385views

    IE crashing with a Runtime error while running javascript

    IE is closing with the error window as shown below (source: tutorboy.com) In my web Application there is once mutil tab page having diffrecnt graph floating function with AJAX. This graph and tab ...

    0votes

    1answer

    558views

    DevExpress VCL Subscription 20.2.8

    Released: May 26, 2021

    Mises à jour de 20.2.8

    Correctifs

    ExpressBars Suite

    • TcxBarEditItem - cxComboBox - The OnDrawItem event does not fire for an inactive editor whose DropDownListStyle property is set to lsFixedList.

    ExpressEditors Library

    • Find Panel - Compact Layout - The "Close" button has a different horizontal offset compared to the Filter Panel.
    • TcxSpinButton - Assigning a control to the Associate property freezes the IDE if the spin button is located on TToolBar.
    • TdxSaveFileDialog and TdxOpenFileDialog do not update the FileName, Files, and FilterIndex property values before raising the OnFolderChange, OnSelectionChange, or OnTypeChange event.

    ExpressLayout Control

    • A right-aligned item becomes unaligned when its parent group applies wrapping to nested items.

    ExpressLibrary

    • The "Runtime error 216" occurs on closing an application that uses Chromium Embedded Framework (CEF).

    ExpressPrinting System

    • Images of the same size are all replaced by one of these images when they are printed in Microsoft Windows 10 (OS Build 2004 or later).

    ExpressQuantumGrid Suite

    • All Views except Chart - An AV occurs when a RestoreFrom~ method call deletes columns that are absent in previously stored View information if one of them is focused.
    • Microsoft Excel-inspired filter popup - cxDateEdit - A popup's editor displays a selected value incorrectly if the container control item's Properties.Kind property is set to ckDateTime or the global FormatSettings.DataSeparator setting has a custom value.
    • Table and Banded Table Views - A modal Edit form allows users to edit a column whose Properties.ReadOnly property is set to True.

    ExpressQuantumTreeList Suite

    • Changing the size of a column in a band changes the size of other columns in this band after an AdjustColumnsWidth procedure call.
    • The "List index out of bounds" exception occurs when modifying the number of nodes or columns in a filtered tree list's BeginUpdate/EndUpdate block.
    • The AdjustColumnsWidth procedure requires multiple calls to make columns fit horizontally the entire client area.

    ExpressSpreadSheet

    • A formula expression returns incorrect results in certain cases if it includes the VLOOKUP or HLOOKUP function that accepts a defined name as the table_array parameter.
    • Operators do not exclude microseconds when comparing date-time values.
    • The "Unexpected token was found ("#0" in"")" exception occurs when loading an ODS document if its metadata includes an empty date/time field.
    • The INDEX function containing references to entire columns/rows returns an incorrect result.

    Back to DevExpress VCL Subscription Releases

    restic fatal error: runtime: out of memory #526

    I think this is the same issue I've been experiencing for a while. Is it?

    Here the full log:

    using parent snapshot a30ccde2
    scan [/home/]
    runtime: memory allocated by OS (2863652864) not in usable range [0x18900000,0x98900000)
    runtime: out of memory: cannot allocate 1048576-byte block (1878720512 in use)
    fatal error: out of memory

    runtime stack:
    runtime.throw(0x84df220, 0xd)
    /usr/local/go/src/runtime/panic.go:527 +0x7f
    runtime.largeAlloc(0xffe00, 0x1, 0x4a31abec)
    /usr/local/go/src/runtime/malloc.go:750 +0xc3
    runtime.mallocgc.func3()
    /usr/local/go/src/runtime/malloc.go:637 +0x30
    runtime.systemstack(0x18918000)
    /usr/local/go/src/runtime/asm_386.s:267 +0x57
    runtime.mstart()
    /usr/local/go/src/runtime/proc1.go:668

    goroutine 1069 [running]:
    runtime.systemstack_switch()
    /usr/local/go/src/runtime/asm_386.s:222 fp=0x4a31ab20 sp=0x4a31ab1c
    runtime.mallocgc(0xffe00, 0x83dc200, 0x1, 0x2a625e00)
    /usr/local/go/src/runtime/malloc.go:638 +0x77f fp=0x4a31ab88 sp=0x4a31ab20
    runtime.newarray(0x83dc200, 0xffe00, 0x80cd980)
    /usr/local/go/src/runtime/malloc.go:780 +0xbc fp=0x4a31abac sp=0x4a31ab88
    runtime.makeslice(0x83d2a40, 0xffe00, 0x0, 0xffe00, 0x0, 0x0, 0x0, 0x0)
    /usr/local/go/src/runtime/slice.go:32 +0x180 fp=0x4a31abec sp=0x4a31abac
    bytes.makeSlice(0xffe00, 0x0, 0x0, 0x0)
    /usr/local/go/src/bytes/buffer.go:195 +0x67 fp=0x4a31ac1c sp=0x4a31abec
    bytes.(_Buffer).ReadFrom(0x4a31acc4, 0xaac82338, 0x59b05200, 0x7fe00, 0x0, 0x0, 0x0)
    /usr/local/go/src/bytes/buffer.go:167 +0xa7 fp=0x4a31ac7c sp=0x4a31ac1c
    io/ioutil.readAll(0xaac82338, 0x59b05200, 0x200, 0x0, 0x0, 0x0, 0x0, 0x0, 0x0)
    /usr/local/go/src/io/ioutil/ioutil.go:33 +0x136 fp=0x4a31ad20 sp=0x4a31ac7c
    io/ioutil.ReadAll(0xaac82338, 0x59b05200, 0x0, 0x0, 0x0, 0x0, 0x0)
    /usr/local/go/src/io/ioutil/ioutil.go:42 +0x51 fp=0x4a31ad48 sp=0x4a31ad20
    github.com/restic/restic/repository.(_Repository).SaveFrom(0x189109f0, 0x3731a200, 0x4a31ae79, 0x8baaf, 0xaac82338, 0x59b05200, 0x0, 0x0)
    /tmp/restic-build-875717092/src/github.com/restic/restic/repository/repository.go:222 +0x2a8 fp=0x4a31adf0 sp=0x4a31ad48
    github.com/restic/restic.(_Archiver).Save(0x3ad50330, 0x31a2f400, 0x17f72437, 0x45fed6ca, 0x14c35c42, 0xa8e28d49, 0x8b950542, 0x1a99b3bb, 0xf9b23690, 0x746172d8, ...)
    /tmp/restic-build-875717092/src/github.com/restic/restic/archiver.go:101 +0x2bb fp=0x4a31ae74 sp=0x4a31adf0
    github.com/restic/restic.(_Archiver).saveChunk(0x3ad50330, 0x59b051e0, 0x0, 0x5b577d00, 0x59b0d020)
    /tmp/restic-build-875717092/src/github.com/restic/restic/archiver.go:162 +0x29c fp=0x4a31afc0 sp=0x4a31ae74
    runtime.goexit()
    /usr/local/go/src/runtime/asm_386.s:1662 +0x1 fp=0x4a31afc4 sp=0x4a31afc0
    created by github.com/restic/restic.(*Archiver).SaveFile
    /tmp/restic-build-875717092/src/github.com/restic/restic/archiver.go:237 +0x360

    goroutine 1 [semacquire, 3 minutes]:
    sync.runtime_Semacquire(0x240994dc)
    /usr/local/go/src/runtime/sema.go:43 +0x26
    sync.(_WaitGroup).Wait(0x240994d0)
    /usr/local/go/src/sync/waitgroup.go:126 +0xa4
    github.com/restic/restic.(_Archiver).Snapshot(0x3ad50330, 0x0, 0x18922bd0, 0x1, 0x1, 0x394a6b80, 0x0, 0x0, 0x0, 0x0, ...)
    /tmp/restic-build-875717092/src/github.com/restic/restic/archiver.go:713 +0x7c9
    main.CmdBackup.Execute(0x0, 0x0, 0x0, 0x0, 0x0, 0x0, 0x86dc100, 0x189bad30, 0x1, 0x2, ...)
    /tmp/restic-build-875717092/src/github.com/restic/restic/cmd/restic/cmd_backup.go:330 +0xce0
    main.(_CmdBackup).Execute(0x1890bce0, 0x189bad30, 0x1, 0x2, 0x0, 0x0)
    :12 +0xa5
    github.com/jessevdk/go-flags.(_Parser).ParseArgs(0x189107b0, 0x1890a168, 0x2, 0x3, 0x0, 0x0, 0x0, 0x0, 0x0)
    /tmp/restic-build-875717092/src/github.com/jessevdk/go-flags/parser.go:278 +0x792
    github.com/jessevdk/go-flags.(*Parser).Parse(0x189107b0, 0x0, 0x0, 0x0, 0x0, 0x0)
    /tmp/restic-build-875717092/src/github.com/jessevdk/go-flags/parser.go:154 +0x78
    main.main()
    /tmp/restic-build-875717092/src/github.com/restic/restic/cmd/restic/main.go:26 +0x159

    goroutine 17 [syscall, 16 minutes, locked to thread]:
    runtime.goexit()
    /usr/local/go/src/runtime/asm_386.s:1662 +0x1

    goroutine 5 [syscall, 16 minutes]:
    os/signal.loop()
    /usr/local/go/src/os/signal/signal_unix.go:22 +0x1a
    created by os/signal.init.1
    /usr/local/go/src/os/signal/signal_unix.go:28 +0x36

    goroutine 6 [chan receive, 16 minutes]:
    github.com/restic/restic.init.1.func1.1()
    /tmp/restic-build-875717092/src/github.com/restic/restic/lock.go:262 +0x114
    created by github.com/restic/restic.init.1.func1
    /tmp/restic-build-875717092/src/github.com/restic/restic/lock.go:265 +0x2a

    goroutine 7 [select, 16 minutes, locked to thread]:
    runtime.gopark(0x858642c, 0x18920f8c, 0x84b2e08, 0x6, 0x86dc318, 0x2)
    /usr/local/go/src/runtime/proc.go:185 +0x12d
    runtime.selectgoImpl(0x18920f8c, 0x0, 0xc)
    /usr/local/go/src/runtime/select.go:392 +0x9ee
    runtime.selectgo(0x18920f8c)
    /usr/local/go/src/runtime/select.go:212 +0xf
    runtime.ensureSigM.func1()
    /usr/local/go/src/runtime/signal1_unix.go:227 +0x2f9
    runtime.goexit()
    /usr/local/go/src/runtime/asm_386.s:1662 +0x1

    goroutine 8 [chan receive, 16 minutes]:
    main.CleanupHandler(0x189a88c0)
    /tmp/restic-build-875717092/src/github.com/restic/restic/cmd/restic/cleanup.go:58 +0x59
    created by main.init.1
    /tmp/restic-build-875717092/src/github.com/restic/restic/cmd/restic/cleanup.go:25 +0xff

    goroutine 18 [select]:
    main.refreshLocks(0x86dc050, 0x1ca13080)
    /tmp/restic-build-875717092/src/github.com/restic/restic/cmd/restic/lock.go:69 +0x350
    created by main.lockRepository
    /tmp/restic-build-875717092/src/github.com/restic/restic/cmd/restic/lock.go:46 +0x14f

    goroutine 43 [select, 3 minutes]:
    github.com/restic/restic.(_TreeWalker).walk(0x240e9f78, 0x3e7dc380, 0x1c, 0x27f1c370, 0x3ad23f40)
    /tmp/restic-build-875717092/src/github.com/restic/restic/walk.go:108 +0x8d4
    github.com/restic/restic.(_TreeWalker).walk(0x240e9f78, 0x3e7dc340, 0x17, 0x2a7940e0, 0x3ad23f40)
    /tmp/restic-build-875717092/src/github.com/restic/restic/walk.go:98 +0x735
    github.com/restic/restic.(_TreeWalker).walk(0x240e9f78, 0x33a3dce1, 0x9, 0x33a3dd40, 0x3ad23f40)
    /tmp/restic-build-875717092/src/github.com/restic/restic/walk.go:98 +0x735
    github.com/restic/restic.(_TreeWalker).walk(0x240e9f78, 0x0, 0x0, 0x240995b0, 0x3ad23f40)
    /tmp/restic-build-875717092/src/github.com/restic/restic/walk.go:98 +0x735
    github.com/restic/restic.(_TreeWalker).Walk(0x240e9f78, 0x0, 0x0, 0xfef7855b, 0xaf54802, 0x12c0ec43, 0x777eb84f, 0xf0d9a11c, 0xbd5cf7da, 0x47ebdd6, ...)
    /tmp/restic-build-875717092/src/github.com/restic/restic/walk.go:58 +0x494
    github.com/restic/restic.WalkTree(0xaac819f8, 0x189109f0, 0xfef7855b, 0xaf54802, 0x12c0ec43, 0x777eb84f, 0xf0d9a11c, 0xbd5cf7da, 0x47ebdd6, 0x66b10342, ...)
    /tmp/restic-build-875717092/src/github.com/restic/restic/walk.go:186 +0x200
    created by github.com/restic/restic.(_Archiver).Snapshot
    /tmp/restic-build-875717092/src/github.com/restic/restic/archiver.go:663 +0x45b

    goroutine 64 [select]:
    github.com/restic/restic.(_Archiver).dirWorker(0x3ad50330, 0x240994d0, 0x0, 0x3ad23f40, 0x3ad58240)
    /tmp/restic-build-875717092/src/github.com/restic/restic/archiver.go:343 +0x1414
    created by github.com/restic/restic.(_Archiver).Snapshot
    /tmp/restic-build-875717092/src/github.com/restic/restic/archiver.go:702 +0x6ef

    goroutine 58 [select]:
    github.com/restic/restic.(_Archiver).dirWorker(0x3ad50330, 0x240994d0, 0x0, 0x3ad23f40, 0x3ad58240)
    /tmp/restic-build-875717092/src/github.com/restic/restic/archiver.go:343 +0x1414
    created by github.com/restic/restic.(_Archiver).Snapshot
    /tmp/restic-build-875717092/src/github.com/restic/restic/archiver.go:702 +0x6ef

    goroutine 53 [runnable]:
    syscall.Syscall(0x3, 0x9, 0x256ba000, 0x80000, 0x80000, 0x80000, 0x0)
    /usr/local/go/src/syscall/asm_linux_386.s:16 +0x5
    syscall.read(0x9, 0x256ba000, 0x80000, 0x80000, 0x29d7b176, 0x0, 0x0)
    /usr/local/go/src/syscall/zsyscall_linux_386.go:783 +0x4f
    syscall.Read(0x9, 0x256ba000, 0x80000, 0x80000, 0x3412e8f6, 0x0, 0x0)
    /usr/local/go/src/syscall/syscall_unix.go:160 +0x45
    os.(_File).read(0x48398570, 0x256ba000, 0x80000, 0x80000, 0x2c0, 0x0, 0x0)
    /usr/local/go/src/os/file_unix.go:211 +0x4a
    os.(_File).Read(0x48398570, 0x256ba000, 0x80000, 0x80000, 0x40, 0x0, 0x0)
    /usr/local/go/src/os/file.go:95 +0x6f
    io.ReadAtLeast(0xb6305180, 0x48398570, 0x256ba000, 0x80000, 0x80000, 0x80000, 0x0, 0x0, 0x0)
    /usr/local/go/src/io/io.go:298 +0xab
    io.ReadFull(0xb6305180, 0x48398570, 0x256ba000, 0x80000, 0x80000, 0x80000, 0x0, 0x0)
    /usr/local/go/src/io/io.go:316 +0x51
    github.com/restic/chunker.(_Chunker).Next(0x2ff24d20, 0x8585fe0, 0x0, 0x0)
    /tmp/restic-build-875717092/src/github.com/restic/chunker/chunker.go:192 +0x14e
    github.com/restic/restic.(_Archiver).SaveFile(0x3ad50330, 0x0, 0x2ff28900, 0x0, 0x0)
    /tmp/restic-build-875717092/src/github.com/restic/restic/archiver.go:227 +0x18d
    github.com/restic/restic.(_Archiver).fileWorker(0x3ad50330, 0x240994d0, 0x0, 0x3ad23f40, 0x3ad58200)
    /tmp/restic-build-875717092/src/github.com/restic/restic/archiver.go:312 +0x1038
    created by github.com/restic/restic.(_Archiver).Snapshot
    /tmp/restic-build-875717092/src/github.com/restic/restic/archiver.go:701 +0x6a6

    goroutine 59 [chan receive]:
    github.com/restic/restic.waitForResults(0x67f088c0, 0x1, 0x2, 0x0, 0x0, 0x0, 0x0, 0x0)
    /tmp/restic-build-875717092/src/github.com/restic/restic/archiver.go:177 +0xd8
    github.com/restic/restic.(_Archiver).SaveFile(0x3ad50330, 0x0, 0x19ac2d80, 0x0, 0x0)
    /tmp/restic-build-875717092/src/github.com/restic/restic/archiver.go:241 +0x205
    github.com/restic/restic.(_Archiver).fileWorker(0x3ad50330, 0x240994d0, 0x0, 0x3ad23f40, 0x3ad58200)
    /tmp/restic-build-875717092/src/github.com/restic/restic/archiver.go:312 +0x1038
    created by github.com/restic/restic.(*Archiver).Snapshot
    /tmp/restic-build-875717092/src/github.com/restic/restic/archiver.go:701 +0x6a6

    goroutine 52 [chan receive]:
    github.com/restic/restic.(_Archiver).dirWorker(0x3ad50330, 0x240994d0, 0x0, 0x3ad23f40, 0x3ad58240)
    /tmp/restic-build-875717092/src/github.com/restic/restic/archiver.go:364 +0x7f2
    created by github.com/restic/restic.(_Archiver).Snapshot
    /tmp/restic-build-875717092/src/github.com/restic/restic/archiver.go:702 +0x6ef

    goroutine 50 [semacquire]:
    sync.runtime_Semacquire(0x3ad5033c)
    /usr/local/go/src/runtime/sema.go:43 +0x26
    sync.(_Mutex).Lock(0x3ad50338)
    /usr/local/go/src/sync/mutex.go:82 +0x19f
    github.com/restic/restic.(_Archiver).isKnownBlob(0x3ad50330, 0xe5c432a0, 0xe9faa7f9, 0xa86352d0, 0x3a78bfd5, 0x8f2fcd82, 0xa8f55ec0, 0xb0eacbe3, 0x727a67b6, 0xb0eacb00)
    /tmp/restic-build-875717092/src/github.com/restic/restic/archiver.go:75 +0x49
    github.com/restic/restic.(_Archiver).SaveTreeJSON(0x3ad50330, 0x8484b80, 0x2dd60950, 0x0, 0x0, 0x0, 0x0, 0x0, 0x0, 0x0, ...)
    /tmp/restic-build-875717092/src/github.com/restic/restic/archiver.go:121 +0x12a
    github.com/restic/restic.(_Archiver).dirWorker(0x3ad50330, 0x240994d0, 0x0, 0x3ad23f40, 0x3ad58240)
    /tmp/restic-build-875717092/src/github.com/restic/restic/archiver.go:402 +0xb63
    created by github.com/restic/restic.(*Archiver).Snapshot
    /tmp/restic-build-875717092/src/github.com/restic/restic/archiver.go:702 +0x6ef

    goroutine 46 [select]:
    github.com/restic/restic/pipe.Split(0x3ad581c0, 0x3ad58240, 0x3ad58200)
    /tmp/restic-build-875717092/src/github.com/restic/restic/pipe/pipe.go:259 +0x4a1
    github.com/restic/restic.(_Archiver).Snapshot.func2(0x3ad581c0, 0x3ad58240, 0x3ad58200, 0x240994d0)
    /tmp/restic-build-875717092/src/github.com/restic/restic/archiver.go:691 +0x31
    created by github.com/restic/restic.(_Archiver).Snapshot
    /tmp/restic-build-875717092/src/github.com/restic/restic/archiver.go:696 +0x63a

    goroutine 63 [runnable]:
    github.com/restic/chunker.(_Chunker).updateHash(0x499c5d60, 0x3cf76000, 0x80000, 0x80000)
    /tmp/restic-build-875717092/src/github.com/restic/chunker/chunker.go:301
    github.com/restic/chunker.(_Chunker).Next(0x499c5d60, 0x524ad400, 0x0, 0x0)
    /tmp/restic-build-875717092/src/github.com/restic/chunker/chunker.go:293 +0x73a
    github.com/restic/restic.(_Archiver).SaveFile(0x3ad50330, 0x0, 0x499c9800, 0x0, 0x0)
    /tmp/restic-build-875717092/src/github.com/restic/restic/archiver.go:227 +0x18d
    github.com/restic/restic.(_Archiver).fileWorker(0x3ad50330, 0x240994d0, 0x0, 0x3ad23f40, 0x3ad58200)
    /tmp/restic-build-875717092/src/github.com/restic/restic/archiver.go:312 +0x1038
    created by github.com/restic/restic.(*Archiver).Snapshot
    /tmp/restic-build-875717092/src/github.com/restic/restic/archiver.go:701 +0x6a6

    goroutine 48 [select]:
    github.com/restic/restic.(_Archiver).dirWorker(0x3ad50330, 0x240994d0, 0x0, 0x3ad23f40, 0x3ad58240)
    /tmp/restic-build-875717092/src/github.com/restic/restic/archiver.go:343 +0x1414
    created by github.com/restic/restic.(_Archiver).Snapshot
    /tmp/restic-build-875717092/src/github.com/restic/restic/archiver.go:702 +0x6ef

    goroutine 62 [select]:
    github.com/restic/restic.(_Archiver).dirWorker(0x3ad50330, 0x240994d0, 0x0, 0x3ad23f40, 0x3ad58240)
    /tmp/restic-build-875717092/src/github.com/restic/restic/archiver.go:343 +0x1414
    created by github.com/restic/restic.(_Archiver).Snapshot
    /tmp/restic-build-875717092/src/github.com/restic/restic/archiver.go:702 +0x6ef

    goroutine 47 [runnable]:
    github.com/restic/chunker.(_Chunker).updateHash(0x228c15e0, 0x28bf4000, 0x80000, 0x80000)
    /tmp/restic-build-875717092/src/github.com/restic/chunker/chunker.go:301
    github.com/restic/chunker.(_Chunker).Next(0x228c15e0, 0x8585fe0, 0x0, 0x0)
    /tmp/restic-build-875717092/src/github.com/restic/chunker/chunker.go:293 +0x73a
    github.com/restic/restic.(_Archiver).SaveFile(0x3ad50330, 0x0, 0x228c7080, 0x0, 0x0)
    /tmp/restic-build-875717092/src/github.com/restic/restic/archiver.go:227 +0x18d
    github.com/restic/restic.(_Archiver).fileWorker(0x3ad50330, 0x240994d0, 0x0, 0x3ad23f40, 0x3ad58200)
    /tmp/restic-build-875717092/src/github.com/restic/restic/archiver.go:312 +0x1038
    created by github.com/restic/restic.(*Archiver).Snapshot
    /tmp/restic-build-875717092/src/github.com/restic/restic/archiver.go:701 +0x6a6

    goroutine 56 [select]:
    github.com/restic/restic.(_Archiver).dirWorker(0x3ad50330, 0x240994d0, 0x0, 0x3ad23f40, 0x3ad58240)
    /tmp/restic-build-875717092/src/github.com/restic/restic/archiver.go:343 +0x1414
    created by github.com/restic/restic.(_Archiver).Snapshot
    /tmp/restic-build-875717092/src/github.com/restic/restic/archiver.go:702 +0x6ef

    goroutine 54 [chan receive]:
    github.com/restic/restic.(_Archiver).dirWorker(0x3ad50330, 0x240994d0, 0x0, 0x3ad23f40, 0x3ad58240)
    /tmp/restic-build-875717092/src/github.com/restic/restic/archiver.go:364 +0x7f2
    created by github.com/restic/restic.(_Archiver).Snapshot
    /tmp/restic-build-875717092/src/github.com/restic/restic/archiver.go:702 +0x6ef

    goroutine 60 [select]:
    github.com/restic/restic.(_Archiver).dirWorker(0x3ad50330, 0x240994d0, 0x0, 0x3ad23f40, 0x3ad58240)
    /tmp/restic-build-875717092/src/github.com/restic/restic/archiver.go:343 +0x1414
    created by github.com/restic/restic.(_Archiver).Snapshot
    /tmp/restic-build-875717092/src/github.com/restic/restic/archiver.go:702 +0x6ef

    goroutine 51 [chan receive]:
    github.com/restic/restic.waitForResults(0x38f9f0d8, 0x1, 0x2, 0x0, 0x0, 0x0, 0x0, 0x0)
    /tmp/restic-build-875717092/src/github.com/restic/restic/archiver.go:177 +0xd8
    github.com/restic/restic.(_Archiver).SaveFile(0x3ad50330, 0x0, 0x19ac2c00, 0x0, 0x0)
    /tmp/restic-build-875717092/src/github.com/restic/restic/archiver.go:241 +0x205
    github.com/restic/restic.(_Archiver).fileWorker(0x3ad50330, 0x240994d0, 0x0, 0x3ad23f40, 0x3ad58200)
    /tmp/restic-build-875717092/src/github.com/restic/restic/archiver.go:312 +0x1038
    created by github.com/restic/restic.(*Archiver).Snapshot
    /tmp/restic-build-875717092/src/github.com/restic/restic/archiver.go:701 +0x6a6

    goroutine 57 [chan receive]:
    github.com/restic/restic.waitForResults(0x8441cb78, 0x1, 0x2, 0x0, 0x0, 0x0, 0x0, 0x0)
    /tmp/restic-build-875717092/src/github.com/restic/restic/archiver.go:177 +0xd8
    github.com/restic/restic.(_Archiver).SaveFile(0x3ad50330, 0x0, 0x19ac2b40, 0x0, 0x0)
    /tmp/restic-build-875717092/src/github.com/restic/restic/archiver.go:241 +0x205
    github.com/restic/restic.(_Archiver).fileWorker(0x3ad50330, 0x240994d0, 0x0, 0x3ad23f40, 0x3ad58200)
    /tmp/restic-build-875717092/src/github.com/restic/restic/archiver.go:312 +0x1038
    created by github.com/restic/restic.(*Archiver).Snapshot
    /tmp/restic-build-875717092/src/github.com/restic/restic/archiver.go:701 +0x6a6

    goroutine 45 [chan send]:
    github.com/restic/restic.(_archivePipe).compare(0x6ce49958, 0x3ad23f40, 0x3ad581c0)
    /tmp/restic-build-875717092/src/github.com/restic/restic/archiver.go:532 +0x97e
    created by github.com/restic/restic.(_Archiver).Snapshot
    /tmp/restic-build-875717092/src/github.com/restic/restic/archiver.go:682 +0x583

    goroutine 44 [select]:
    github.com/restic/restic/pipe.walk(0xbfa28eeb, 0xa, 0x53f41480, 0x3c, 0x63450640, 0x3ad23f40, 0x3ad58140, 0x53f41500, 0x8073800)
    /tmp/restic-build-875717092/src/github.com/restic/restic/pipe/pipe.go:111 +0xa58
    github.com/restic/restic/pipe.walk(0xbfa28eeb, 0xa, 0x6126d740, 0x2d, 0x63450640, 0x3ad23f40, 0x3ad58140, 0x2396fc00, 0x8073800)
    /tmp/restic-build-875717092/src/github.com/restic/restic/pipe/pipe.go:161 +0x1bac
    github.com/restic/restic/pipe.walk(0xbfa28eeb, 0xa, 0x2c97e3c0, 0x22, 0x63450640, 0x3ad23f40, 0x3ad58140, 0x2df82b40, 0x8073c00)
    /tmp/restic-build-875717092/src/github.com/restic/restic/pipe/pipe.go:161 +0x1bac
    github.com/restic/restic/pipe.walk(0xbfa28eeb, 0xa, 0x4e31f380, 0x1c, 0x63450640, 0x3ad23f40, 0x3ad58140, 0x591f4cc0, 0x0)
    /tmp/restic-build-875717092/src/github.com/restic/restic/pipe/pipe.go:161 +0x1bac
    github.com/restic/restic/pipe.walk(0xbfa28eeb, 0xa, 0xbfa28eeb, 0x14, 0x63450640, 0x3ad23f40, 0x3ad58140, 0x240cce40, 0x0)
    /tmp/restic-build-875717092/src/github.com/restic/restic/pipe/pipe.go:161 +0x1bac
    github.com/restic/restic/pipe.Walk(0x18922bd0, 0x1, 0x1, 0x63450640, 0x3ad23f40, 0x3ad58140, 0x3ad58180)
    /tmp/restic-build-875717092/src/github.com/restic/restic/pipe/pipe.go:220 +0x6c2
    github.com/restic/restic.(_Archiver).Snapshot.func1(0x18922bd0, 0x1, 0x1, 0x3ad50330, 0x3ad23f40, 0x3ad58140, 0x3ad58180)
    /tmp/restic-build-875717092/src/github.com/restic/restic/archiver.go:676 +0x54
    created by github.com/restic/restic.(_Archiver).Snapshot
    /tmp/restic-build-875717092/src/github.com/restic/restic/archiver.go:678 +0x515

    goroutine 55 [chan receive]:
    github.com/restic/restic.waitForResults(0x23efb2d0, 0x1, 0x2, 0x0, 0x0, 0x0, 0x0, 0x0)
    /tmp/restic-build-875717092/src/github.com/restic/restic/archiver.go:177 +0xd8
    github.com/restic/restic.(_Archiver).SaveFile(0x3ad50330, 0x0, 0x19ac2cc0, 0x0, 0x0)
    /tmp/restic-build-875717092/src/github.com/restic/restic/archiver.go:241 +0x205
    github.com/restic/restic.(_Archiver).fileWorker(0x3ad50330, 0x240994d0, 0x0, 0x3ad23f40, 0x3ad58200)
    /tmp/restic-build-875717092/src/github.com/restic/restic/archiver.go:312 +0x1038
    created by github.com/restic/restic.(*Archiver).Snapshot
    /tmp/restic-build-875717092/src/github.com/restic/restic/archiver.go:701 +0x6a6

    goroutine 61 [runnable]:
    syscall.Syscall(0x3, 0x6, 0x25b4c000, 0x80000, 0x39c74, 0x80000, 0x0)
    /usr/local/go/src/syscall/asm_linux_386.s:16 +0x5
    syscall.read(0x6, 0x25b4c000, 0x80000, 0x80000, 0x14, 0x0, 0x0)
    /usr/local/go/src/syscall/zsyscall_linux_386.go:783 +0x4f
    syscall.Read(0x6, 0x25b4c000, 0x80000, 0x80000, 0x0, 0x0, 0x0)
    /usr/local/go/src/syscall/syscall_unix.go:160 +0x45
    os.(_File).read(0x53f3e638, 0x25b4c000, 0x80000, 0x80000, 0x2, 0x0, 0x0)
    /usr/local/go/src/os/file_unix.go:211 +0x4a
    os.(_File).Read(0x53f3e638, 0x25b4c000, 0x80000, 0x80000, 0x8583184, 0x0, 0x0)
    /usr/local/go/src/os/file.go:95 +0x6f
    io.ReadAtLeast(0xb6305180, 0x53f3e638, 0x25b4c000, 0x80000, 0x80000, 0x80000, 0x0, 0x0, 0x0)
    /usr/local/go/src/io/io.go:298 +0xab
    io.ReadFull(0xb6305180, 0x53f3e638, 0x25b4c000, 0x80000, 0x80000, 0x80ae530, 0x0, 0x0)
    /usr/local/go/src/io/io.go:316 +0x51
    github.com/restic/chunker.(_Chunker).Next(0x450c5220, 0x53f3e638, 0x0, 0x0)
    /tmp/restic-build-875717092/src/github.com/restic/chunker/chunker.go:192 +0x14e
    github.com/restic/restic.(_Archiver).SaveFile(0x3ad50330, 0x0, 0x3ad26240, 0x0, 0x0)
    /tmp/restic-build-875717092/src/github.com/restic/restic/archiver.go:227 +0x18d
    github.com/restic/restic.(_Archiver).fileWorker(0x3ad50330, 0x240994d0, 0x0, 0x3ad23f40, 0x3ad58200)
    /tmp/restic-build-875717092/src/github.com/restic/restic/archiver.go:312 +0x1038
    created by github.com/restic/restic.(_Archiver).Snapshot
    /tmp/restic-build-875717092/src/github.com/restic/restic/archiver.go:701 +0x6a6

    goroutine 49 [chan receive]:
    github.com/restic/restic.waitForResults(0x59afd808, 0x1, 0x2, 0x0, 0x0, 0x0, 0x0, 0x0)
    /tmp/restic-build-875717092/src/github.com/restic/restic/archiver.go:177 +0xd8
    github.com/restic/restic.(_Archiver).SaveFile(0x3ad50330, 0x0, 0x19ac2a80, 0x0, 0x0)
    /tmp/restic-build-875717092/src/github.com/restic/restic/archiver.go:241 +0x205
    github.com/restic/restic.(_Archiver).fileWorker(0x3ad50330, 0x240994d0, 0x0, 0x3ad23f40, 0x3ad58200)
    /tmp/restic-build-875717092/src/github.com/restic/restic/archiver.go:312 +0x1038
    created by github.com/restic/restic.(*Archiver).Snapshot
    /tmp/restic-build-875717092/src/github.com/restic/restic/archiver.go:701 +0x6a6

    goroutine 65 [runnable]:
    github.com/restic/chunker.(_Chunker).updateHash(0x499c5b80, 0x1a0f8000, 0x80000, 0x80000)
    /tmp/restic-build-875717092/src/github.com/restic/chunker/chunker.go:301
    github.com/restic/chunker.(_Chunker).Next(0x499c5b80, 0x8585fe0, 0x0, 0x0)
    /tmp/restic-build-875717092/src/github.com/restic/chunker/chunker.go:293 +0x73a
    github.com/restic/restic.(_Archiver).SaveFile(0x3ad50330, 0x0, 0x499c95c0, 0x0, 0x0)
    /tmp/restic-build-875717092/src/github.com/restic/restic/archiver.go:227 +0x18d
    github.com/restic/restic.(_Archiver).fileWorker(0x3ad50330, 0x240994d0, 0x0, 0x3ad23f40, 0x3ad58200)
    /tmp/restic-build-875717092/src/github.com/restic/restic/archiver.go:312 +0x1038
    created by github.com/restic/restic.(*Archiver).Snapshot
    /tmp/restic-build-875717092/src/github.com/restic/restic/archiver.go:701 +0x6a6

    goroutine 66 [select]:
    github.com/restic/restic.(_Archiver).dirWorker(0x3ad50330, 0x240994d0, 0x0, 0x3ad23f40, 0x3ad58240)
    /tmp/restic-build-875717092/src/github.com/restic/restic/archiver.go:343 +0x1414
    created by github.com/restic/restic.(_Archiver).Snapshot
    /tmp/restic-build-875717092/src/github.com/restic/restic/archiver.go:702 +0x6ef

    goroutine 67 [select]:
    github.com/restic/restic.(_Archiver).saveIndexes(0x3ad50330, 0x240994e0, 0x3ad58280)
    /tmp/restic-build-875717092/src/github.com/restic/restic/archiver.go:596 +0x34c
    created by github.com/restic/restic.(_Archiver).Snapshot
    /tmp/restic-build-875717092/src/github.com/restic/restic/archiver.go:709 +0x786

    goroutine 68 [select, 3 minutes]:
    github.com/restic/restic.loadTreeWorker(0x24099530, 0x3ad58300, 0x24099520, 0x3ad23f40)
    /tmp/restic-build-875717092/src/github.com/restic/restic/walk.go:134 +0x5d2
    created by github.com/restic/restic.WalkTree
    /tmp/restic-build-875717092/src/github.com/restic/restic/walk.go:182 +0x1a9

    goroutine 69 [select, 3 minutes]:
    github.com/restic/restic.loadTreeWorker(0x24099530, 0x3ad58300, 0x24099520, 0x3ad23f40)
    /tmp/restic-build-875717092/src/github.com/restic/restic/walk.go:134 +0x5d2
    created by github.com/restic/restic.WalkTree
    /tmp/restic-build-875717092/src/github.com/restic/restic/walk.go:182 +0x1a9

    goroutine 70 [select, 3 minutes]:
    github.com/restic/restic.loadTreeWorker(0x24099530, 0x3ad58300, 0x24099520, 0x3ad23f40)
    /tmp/restic-build-875717092/src/github.com/restic/restic/walk.go:134 +0x5d2
    created by github.com/restic/restic.WalkTree
    /tmp/restic-build-875717092/src/github.com/restic/restic/walk.go:182 +0x1a9

    goroutine 71 [select, 3 minutes]:
    github.com/restic/restic.loadTreeWorker(0x24099530, 0x3ad58300, 0x24099520, 0x3ad23f40)
    /tmp/restic-build-875717092/src/github.com/restic/restic/walk.go:134 +0x5d2
    created by github.com/restic/restic.WalkTree
    /tmp/restic-build-875717092/src/github.com/restic/restic/walk.go:182 +0x1a9

    goroutine 72 [select, 3 minutes]:
    github.com/restic/restic.loadTreeWorker(0x24099530, 0x3ad58300, 0x24099520, 0x3ad23f40)
    /tmp/restic-build-875717092/src/github.com/restic/restic/walk.go:134 +0x5d2
    created by github.com/restic/restic.WalkTree
    /tmp/restic-build-875717092/src/github.com/restic/restic/walk.go:182 +0x1a9

    goroutine 73 [select, 3 minutes]:
    github.com/restic/restic.loadTreeWorker(0x24099530, 0x3ad58300, 0x24099520, 0x3ad23f40)
    /tmp/restic-build-875717092/src/github.com/restic/restic/walk.go:134 +0x5d2
    created by github.com/restic/restic.WalkTree
    /tmp/restic-build-875717092/src/github.com/restic/restic/walk.go:182 +0x1a9

    goroutine 74 [select, 3 minutes]:
    github.com/restic/restic.loadTreeWorker(0x24099530, 0x3ad58300, 0x24099520, 0x3ad23f40)
    /tmp/restic-build-875717092/src/github.com/restic/restic/walk.go:134 +0x5d2
    created by github.com/restic/restic.WalkTree
    /tmp/restic-build-875717092/src/github.com/restic/restic/walk.go:182 +0x1a9

    goroutine 75 [select, 3 minutes]:
    github.com/restic/restic.loadTreeWorker(0x24099530, 0x3ad58300, 0x24099520, 0x3ad23f40)
    /tmp/restic-build-875717092/src/github.com/restic/restic/walk.go:134 +0x5d2
    created by github.com/restic/restic.WalkTree
    /tmp/restic-build-875717092/src/github.com/restic/restic/walk.go:182 +0x1a9

    goroutine 76 [select, 3 minutes]:
    github.com/restic/restic.loadTreeWorker(0x24099530, 0x3ad58300, 0x24099520, 0x3ad23f40)
    /tmp/restic-build-875717092/src/github.com/restic/restic/walk.go:134 +0x5d2
    created by github.com/restic/restic.WalkTree
    /tmp/restic-build-875717092/src/github.com/restic/restic/walk.go:182 +0x1a9

    goroutine 77 [select, 3 minutes]:
    github.com/restic/restic.loadTreeWorker(0x24099530, 0x3ad58300, 0x24099520, 0x3ad23f40)
    /tmp/restic-build-875717092/src/github.com/restic/restic/walk.go:134 +0x5d2
    created by github.com/restic/restic.WalkTree
    /tmp/restic-build-875717092/src/github.com/restic/restic/walk.go:182 +0x1a9

    goroutine 1070 [runnable]:
    crypto/aes.(_aesCipher).BlockSize(0x67eb6560, 0x138410)
    /usr/local/go/src/crypto/aes/cipher.go:46
    crypto/cipher.(_ctr).XORKeyStream(0x3ad24c30, 0x8876fde0, 0x138220, 0x138220, 0x8856fdd0, 0x136da4, 0x1f0030)
    /usr/local/go/src/crypto/cipher/ctr.go:68 +0x4a
    github.com/restic/restic/crypto.Encrypt(0x18916140, 0x88760000, 0x148000, 0x148000, 0x88560000, 0x146b74, 0x1ffe00, 0x0, 0x0, 0x0, ...)
    /tmp/restic-build-875717092/src/github.com/restic/restic/crypto/crypto.go:262 +0x52f
    github.com/restic/restic/repository.(_Repository).Encrypt(0x189109f0, 0x422ec000, 0x80000, 0x80000, 0x88560000, 0x146b74, 0x1ffe00, 0x0, 0x0, 0x0, ...)
    /tmp/restic-build-875717092/src/github.com/restic/restic/repository/repository.go:474 +0x124
    github.com/restic/restic/repository.(_Repository).SaveAndEncrypt(0x189109f0, 0x2994a600, 0x88560000, 0x146b74, 0x1ffe00, 0x240dce79, 0x0, 0x0, 0x0, 0x0, ...)
    /tmp/restic-build-875717092/src/github.com/restic/restic/repository/repository.go:186 +0x2ea
    github.com/restic/restic/repository.(_Repository).SaveFrom(0x189109f0, 0xf5c20a00, 0x240dce79, 0x146b74, 0xaac82338, 0x2994a6e0, 0x0, 0x0)
    /tmp/restic-build-875717092/src/github.com/restic/restic/repository/repository.go:227 +0x31c
    github.com/restic/restic.(_Archiver).Save(0x3ad50330, 0xc20ad700, 0x717116f5, 0x17b9c6ad, 0xc416631, 0x1a4fe32f, 0xfceeff81, 0x1df827ea, 0x9ea880c7, 0xbfa28ea2, ...)
    /tmp/restic-build-875717092/src/github.com/restic/restic/archiver.go:101 +0x2bb
    github.com/restic/restic.(_Archiver).saveChunk(0x3ad50330, 0x2994a6c0, 0x0, 0x40a8e590, 0x2994d200)
    /tmp/restic-build-875717092/src/github.com/restic/restic/archiver.go:162 +0x29c
    created by github.com/restic/restic.(_Archiver).SaveFile
    /tmp/restic-build-875717092/src/github.com/restic/restic/archiver.go:237 +0x360

    goroutine 1086 [semacquire]:
    sync.runtime_Semacquire(0x3ad5033c)
    /usr/local/go/src/runtime/sema.go:43 +0x26
    sync.(_Mutex).Lock(0x3ad50338)
    /usr/local/go/src/sync/mutex.go:82 +0x19f
    github.com/restic/restic.(_Archiver).isKnownBlob(0x3ad50330, 0x5c6dbdb, 0x73b9e1e, 0x37529bd, 0x706bde9e, 0x3546960e, 0xc306a32d, 0x614b8cea, 0xd85ad89f, 0x0)
    /tmp/restic-build-875717092/src/github.com/restic/restic/archiver.go:75 +0x49
    github.com/restic/restic.(_Archiver).Save(0x3ad50330, 0xc6dbdb00, 0x3b9e1e05, 0x7529bd07, 0x6bde9e03, 0x46960e70, 0x6a32d35, 0x4b8ceac3, 0x5ad89f61, 0x5309c4d8, ...)
    /tmp/restic-build-875717092/src/github.com/restic/restic/archiver.go:96 +0x16f
    github.com/restic/restic.(_Archiver).saveChunk(0x3ad50330, 0x377f0e20, 0x0, 0x48398570, 0x377f5b60)
    /tmp/restic-build-875717092/src/github.com/restic/restic/archiver.go:162 +0x29c
    created by github.com/restic/restic.(*Archiver).SaveFile
    /tmp/restic-build-875717092/src/github.com/restic/restic/archiver.go:237 +0x360

    goroutine 1074 [semacquire]:
    sync.runtime_Semacquire(0x3ad5033c)
    /usr/local/go/src/runtime/sema.go:43 +0x26
    sync.(_Mutex).Lock(0x3ad50338)
    /usr/local/go/src/sync/mutex.go:82 +0x19f
    github.com/restic/restic.(_Archiver).isKnownBlob(0x3ad50330, 0x60933445, 0xbe8eeb6a, 0x6f02d42f, 0xbb24a44, 0x93521ae1, 0x2d6dc886, 0x59b29dc2, 0xddfbb7b2, 0x0)
    /tmp/restic-build-875717092/src/github.com/restic/restic/archiver.go:75 +0x49
    github.com/restic/restic.(_Archiver).Save(0x3ad50330, 0x93344500, 0x8eeb6a60, 0x2d42fbe, 0xb24a446f, 0x521ae10b, 0x6dc88693, 0xb29dc22d, 0xfbb7b259, 0x240b2fdd, ...)
    /tmp/restic-build-875717092/src/github.com/restic/restic/archiver.go:96 +0x16f
    github.com/restic/restic.(_Archiver).saveChunk(0x3ad50330, 0x28d8e980, 0x0, 0x58daba48, 0x28d8dc20)
    /tmp/restic-build-875717092/src/github.com/restic/restic/archiver.go:162 +0x29c
    created by github.com/restic/restic.(*Archiver).SaveFile
    /tmp/restic-build-875717092/src/github.com/restic/restic/archiver.go:237 +0x360

    goroutine 1085 [semacquire]:
    sync.runtime_Semacquire(0x3ad5033c)
    /usr/local/go/src/runtime/sema.go:43 +0x26
    sync.(_Mutex).Lock(0x3ad50338)
    /usr/local/go/src/sync/mutex.go:82 +0x19f
    github.com/restic/restic.(_Archiver).isKnownBlob(0x3ad50330, 0x67674fbf, 0xf2d0376d, 0x65615d58, 0x290031fa, 0x23c4c49, 0xfd7c4080, 0x3bc40fe1, 0xc18747c9, 0x0)
    /tmp/restic-build-875717092/src/github.com/restic/restic/archiver.go:75 +0x49
    github.com/restic/restic.(_Archiver).Save(0x3ad50330, 0x674fbf00, 0xd0376d67, 0x615d58f2, 0x31fa65, 0x3c4c4929, 0x7c408002, 0xc40fe1fd, 0x8747c93b, 0xbfa28ec1, ...)
    /tmp/restic-build-875717092/src/github.com/restic/restic/archiver.go:96 +0x16f
    github.com/restic/restic.(_Archiver).saveChunk(0x3ad50330, 0x5b505400, 0x0, 0x40a8e590, 0x4ddd0cc0)
    /tmp/restic-build-875717092/src/github.com/restic/restic/archiver.go:162 +0x29c
    created by github.com/restic/restic.(*Archiver).SaveFile
    /tmp/restic-build-875717092/src/github.com/restic/restic/archiver.go:237 +0x360

    goroutine 1035 [runnable]:
    bytes.makeSlice(0xbc7ab5, 0x0, 0x0, 0x0)
    /usr/local/go/src/bytes/buffer.go:195 +0x67
    bytes.(_Buffer).grow(0x630eb8c0, 0x379923, 0x240dea90)
    /usr/local/go/src/bytes/buffer.go:103 +0x1d7
    bytes.(_Buffer).Write(0x630eb8c0, 0x8223a000, 0x379923, 0x37a000, 0x53f3a980, 0x0, 0x0)
    /usr/local/go/src/bytes/buffer.go:131 +0x3e
    bytes.(_Reader).WriteTo(0x53f36d80, 0xaac82878, 0x630eb8c0, 0x240deb8c, 0x808ba01, 0x0, 0x0)
    /usr/local/go/src/bytes/reader.go:137 +0xba
    io.copyBuffer(0xaac82878, 0x630eb8c0, 0xb6306518, 0x53f36d80, 0x0, 0x0, 0x0, 0x0, 0x0, 0x0, ...)
    /usr/local/go/src/io/io.go:371 +0xa1
    io.Copy(0xaac82878, 0x630eb8c0, 0xb6306518, 0x53f36d80, 0x18, 0x53f36d80, 0x0, 0x0)
    /usr/local/go/src/io/io.go:351 +0x53
    github.com/restic/restic/pack.(_Packer).Add(0x697ddd20, 0x33d4c400, 0x2ebb283a, 0x48f95fc5, 0x55f7f030, 0x959417ac, 0x7832271b, 0xb3749782, 0xed94f4bd, 0x37a017, ...)
    /tmp/restic-build-875717092/src/github.com/restic/restic/pack/pack.go:105 +0xf7
    github.com/restic/restic/repository.(_Repository).SaveAndEncrypt(0x189109f0, 0x392eb500, 0x81940000, 0x379903, 0x3ffe00, 0x240dee79, 0x0, 0x0, 0x0, 0x0, ...)
    /tmp/restic-build-875717092/src/github.com/restic/restic/repository/repository.go:198 +0x4b8
    github.com/restic/restic/repository.(_Repository).SaveFrom(0x189109f0, 0x3a33d400, 0x240dee79, 0x379903, 0xaac82338, 0x392eb580, 0x0, 0x0)
    /tmp/restic-build-875717092/src/github.com/restic/restic/repository/repository.go:227 +0x31c
    github.com/restic/restic.(_Archiver).Save(0x3ad50330, 0x33d4c400, 0x2ebb283a, 0x48f95fc5, 0x55f7f030, 0x959417ac, 0x7832271b, 0xb3749782, 0xed94f4bd, 0x3ad5bf17, ...)
    /tmp/restic-build-875717092/src/github.com/restic/restic/archiver.go:101 +0x2bb
    github.com/restic/restic.(_Archiver).saveChunk(0x3ad50330, 0x392eb560, 0x0, 0x40a8e590, 0x2f42a3c0)
    /tmp/restic-build-875717092/src/github.com/restic/restic/archiver.go:162 +0x29c
    created by github.com/restic/restic.(*Archiver).SaveFile
    /tmp/restic-build-875717092/src/github.com/restic/restic/archiver.go:237 +0x360

    goroutine 1080 [semacquire]:
    sync.runtime_Semacquire(0x3ad5033c)
    /usr/local/go/src/runtime/sema.go:43 +0x26
    sync.(_Mutex).Lock(0x3ad50338)
    /usr/local/go/src/sync/mutex.go:82 +0x19f
    github.com/restic/restic.(_Archiver).isKnownBlob(0x3ad50330, 0xdb97ad62, 0x426ef266, 0x8a857f33, 0x8d35701e, 0x5ed7f5c3, 0x8de1b214, 0xd7017194, 0xb26fe97f, 0x0)
    /tmp/restic-build-875717092/src/github.com/restic/restic/archiver.go:75 +0x49
    github.com/restic/restic.(_Archiver).Save(0x3ad50330, 0x97ad6200, 0x6ef266db, 0x857f3342, 0x35701e8a, 0xd7f5c38d, 0xe1b2145e, 0x171948d, 0x6fe97fd7, 0xb2, ...)
    /tmp/restic-build-875717092/src/github.com/restic/restic/archiver.go:96 +0x16f
    github.com/restic/restic.(_Archiver).saveChunk(0x3ad50330, 0x67f06c20, 0x0, 0x3a4967d0, 0x67f0ec00)
    /tmp/restic-build-875717092/src/github.com/restic/restic/archiver.go:162 +0x29c
    created by github.com/restic/restic.(*Archiver).SaveFile
    /tmp/restic-build-875717092/src/github.com/restic/restic/archiver.go:237 +0x360

    goroutine 1079 [semacquire]:
    sync.runtime_Semacquire(0x3ad5033c)
    /usr/local/go/src/runtime/sema.go:43 +0x26
    sync.(_Mutex).Lock(0x3ad50338)
    /usr/local/go/src/sync/mutex.go:82 +0x19f
    github.com/restic/restic.(_Archiver).isKnownBlob(0x3ad50330, 0xf57ae4be, 0x740ee89e, 0x10de4caf, 0x1b2725df, 0x211ac9f2, 0x619d3d7d, 0x759374e3, 0xb7779c2a, 0x0)
    /tmp/restic-build-875717092/src/github.com/restic/restic/archiver.go:75 +0x49
    github.com/restic/restic.(_Archiver).Save(0x3ad50330, 0x7ae4be00, 0xee89ef5, 0xde4caf74, 0x2725df10, 0x1ac9f21b, 0x9d3d7d21, 0x9374e361, 0x779c2a75, 0xb7, ...)
    /tmp/restic-build-875717092/src/github.com/restic/restic/archiver.go:96 +0x16f
    github.com/restic/restic.(_Archiver).saveChunk(0x3ad50330, 0x3963fd20, 0x0, 0x40a8e590, 0x74c65920)
    /tmp/restic-build-875717092/src/github.com/restic/restic/archiver.go:162 +0x29c
    created by github.com/restic/restic.(*Archiver).SaveFile
    /tmp/restic-build-875717092/src/github.com/restic/restic/archiver.go:237 +0x360

    goroutine 1045 [semacquire]:
    sync.runtime_Semacquire(0x5b2d8f04)
    /usr/local/go/src/runtime/sema.go:43 +0x26
    sync.(_Mutex).Lock(0x5b2d8f00)
    /usr/local/go/src/sync/mutex.go:82 +0x19f
    github.com/restic/restic/repository.(_Index).Final(0x5b2d8f00, 0x0)
    /tmp/restic-build-875717092/src/github.com/restic/restic/repository/index.go:56 +0x2c
    github.com/restic/restic/repository.(_MasterIndex).Current(0x189109c0, 0x0)
    /tmp/restic-build-875717092/src/github.com/restic/restic/repository/master_index.go:129 +0x82
    github.com/restic/restic/repository.(_Repository).savePacker(0x189109f0, 0x4ccd2220, 0x0, 0x0)
    /tmp/restic-build-875717092/src/github.com/restic/restic/repository/packer_manager.go:80 +0x70f
    github.com/restic/restic/repository.(_Repository).SaveAndEncrypt(0x189109f0, 0x689dd900, 0x825c0000, 0x1620db, 0x1ffe00, 0x240d4e79, 0x0, 0x0, 0x0, 0x0, ...)
    /tmp/restic-build-875717092/src/github.com/restic/restic/repository/repository.go:212 +0x6bf
    github.com/restic/restic/repository.(_Repository).SaveFrom(0x189109f0, 0xcbfc5400, 0x240d4e79, 0x1620db, 0xaac82338, 0x689dd900, 0x0, 0x0)
    /tmp/restic-build-875717092/src/github.com/restic/restic/repository/repository.go:227 +0x31c
    github.com/restic/restic.(_Archiver).Save(0x3ad50330, 0xfc54f300, 0xda40e3cb, 0xb8ef4301, 0x3fe18cff, 0xd7e19e12, 0x8379fee4, 0x11048b4c, 0xa8936d40, 0x3ad5bf3c, ...)
    /tmp/restic-build-875717092/src/github.com/restic/restic/archiver.go:101 +0x2bb
    github.com/restic/restic.(_Archiver).saveChunk(0x3ad50330, 0x689dd8e0, 0x0, 0x3a4967d0, 0x689e9980)
    /tmp/restic-build-875717092/src/github.com/restic/restic/archiver.go:162 +0x29c
    created by github.com/restic/restic.(*Archiver).SaveFile
    /tmp/restic-build-875717092/src/github.com/restic/restic/archiver.go:237 +0x360

    goroutine 1071 [runnable]:
    syscall.Syscall6(0xb4, 0x4, 0x53e5e400, 0x200, 0x0, 0x0, 0x0, 0x200, 0x200, 0x0)
    /usr/local/go/src/syscall/asm_linux_386.s:41 +0x5
    syscall.Pread(0x4, 0x53e5e400, 0x200, 0x200, 0x0, 0x0, 0x1caee2c0, 0x0, 0x0)
    /usr/local/go/src/syscall/zsyscall_linux_386.go:1362 +0x6b
    os.(_File).pread(0x299487e0, 0x53e5e400, 0x200, 0x200, 0x0, 0x0, 0x53e5e400, 0x0, 0x0)
    /usr/local/go/src/os/file_unix.go:221 +0x5a
    os.(_File).ReadAt(0x299487e0, 0x53e5e400, 0x200, 0x200, 0x0, 0x0, 0x0, 0x0, 0x0)
    /usr/local/go/src/os/file.go:117 +0xa0
    io.(_SectionReader).Read(0x7228d680, 0x53e5e400, 0x200, 0x200, 0x200, 0x0, 0x0)
    /usr/local/go/src/io/io.go:454 +0xe2
    bytes.(_Buffer).ReadFrom(0x4a31ecc4, 0xaac82338, 0x7228d680, 0x0, 0x0, 0x0, 0x0)
    /usr/local/go/src/bytes/buffer.go:173 +0x1c3
    io/ioutil.readAll(0xaac82338, 0x7228d680, 0x200, 0x0, 0x0, 0x0, 0x0, 0x0, 0x0)
    /usr/local/go/src/io/ioutil/ioutil.go:33 +0x136
    io/ioutil.ReadAll(0xaac82338, 0x7228d680, 0x0, 0x0, 0x0, 0x0, 0x0)
    /usr/local/go/src/io/ioutil/ioutil.go:42 +0x51
    github.com/restic/restic/repository.(_Repository).SaveFrom(0x189109f0, 0x20a7fc00, 0x4a31ee79, 0x45b92, 0xaac82338, 0x7228d680, 0x0, 0x0)
    /tmp/restic-build-875717092/src/github.com/restic/restic/repository/repository.go:222 +0x2a8
    github.com/restic/restic.(_Archiver).Save(0x3ad50330, 0xa7fc4f00, 0x3fb5ee20, 0x9ceb2cee, 0xbc4eb1ac, 0x6b741460, 0x76679d67, 0x65fdbb63, 0xb4bcca18, 0xd3, ...)
    /tmp/restic-build-875717092/src/github.com/restic/restic/archiver.go:101 +0x2bb
    github.com/restic/restic.(_Archiver).saveChunk(0x3ad50330, 0x7228d660, 0x0, 0x299487e0, 0x587dc060)
    /tmp/restic-build-875717092/src/github.com/restic/restic/archiver.go:162 +0x29c
    created by github.com/restic/restic.(_Archiver).SaveFile
    /tmp/restic-build-875717092/src/github.com/restic/restic/archiver.go:237 +0x360

    goroutine 1061 [runnable]:
    crypto/aes.(_aesCipher).Encrypt(0x697ddd60, 0x5ba81a90, 0x170, 0x170, 0x46b7f460, 0x10, 0x10)
    /usr/local/go/src/crypto/aes/cipher.go:48
    crypto/cipher.(_ctr).refill(0x5f73d050)
    /usr/local/go/src/crypto/cipher/ctr.go:51 +0x168
    crypto/cipher.(_ctr).XORKeyStream(0x5f73d050, 0x85e5c020, 0xedfe0, 0xedfe0, 0x858bc010, 0xec12a, 0x2cddf0)
    /usr/local/go/src/crypto/cipher/ctr.go:69 +0x6b
    github.com/restic/restic/crypto.Encrypt(0x18916140, 0x85d2a000, 0x220000, 0x220000, 0x8578a000, 0x21e13a, 0x3ffe00, 0x0, 0x0, 0x0, ...)
    /tmp/restic-build-875717092/src/github.com/restic/restic/crypto/crypto.go:262 +0x52f
    github.com/restic/restic/repository.(_Repository).Encrypt(0x189109f0, 0x359d4000, 0x80000, 0x80000, 0x8578a000, 0x21e13a, 0x3ffe00, 0x0, 0x0, 0x0, ...)
    /tmp/restic-build-875717092/src/github.com/restic/restic/repository/repository.go:474 +0x124
    github.com/restic/restic/repository.(_Repository).SaveAndEncrypt(0x189109f0, 0x1b5dd800, 0x8578a000, 0x21e13a, 0x3ffe00, 0x240d2e79, 0x0, 0x0, 0x0, 0x0, ...)
    /tmp/restic-build-875717092/src/github.com/restic/restic/repository/repository.go:186 +0x2ea
    github.com/restic/restic/repository.(_Repository).SaveFrom(0x189109f0, 0x9ca8000, 0x240d2e79, 0x21e13a, 0xaac82338, 0x1b5dd8c0, 0x0, 0x0)
    /tmp/restic-build-875717092/src/github.com/restic/restic/repository/repository.go:227 +0x31c
    github.com/restic/restic.(_Archiver).Save(0x3ad50330, 0xca804a00, 0x2d27ff09, 0x837925db, 0x8975cfb5, 0x6534537c, 0xe781069, 0xfb2a99b6, 0x2dbcb162, 0xca, ...)
    /tmp/restic-build-875717092/src/github.com/restic/restic/archiver.go:101 +0x2bb
    github.com/restic/restic.(_Archiver).saveChunk(0x3ad50330, 0x1b5dd880, 0x0, 0x3a4967d0, 0x1c2705a0)
    /tmp/restic-build-875717092/src/github.com/restic/restic/archiver.go:162 +0x29c
    created by github.com/restic/restic.(*Archiver).SaveFile
    /tmp/restic-build-875717092/src/github.com/restic/restic/archiver.go:237 +0x360

    goroutine 1078 [semacquire]:
    sync.runtime_Semacquire(0x3ad5033c)
    /usr/local/go/src/runtime/sema.go:43 +0x26
    sync.(_Mutex).Lock(0x3ad50338)
    /usr/local/go/src/sync/mutex.go:82 +0x19f
    github.com/restic/restic.(_Archiver).isKnownBlob(0x3ad50330, 0x1a8ef089, 0x1f7b9da, 0xd072ea21, 0xac5d9d3, 0xdd1fe534, 0xe44e99a4, 0x80b5d023, 0xe32feade, 0x0)
    /tmp/restic-build-875717092/src/github.com/restic/restic/archiver.go:75 +0x49
    github.com/restic/restic.(_Archiver).Save(0x3ad50330, 0x8ef08900, 0xf7b9da1a, 0x72ea2101, 0xc5d9d3d0, 0x1fe5340a, 0x4e99a4dd, 0xb5d023e4, 0x2feade80, 0x5309c4e3, ...)
    /tmp/restic-build-875717092/src/github.com/restic/restic/archiver.go:96 +0x16f
    github.com/restic/restic.(_Archiver).saveChunk(0x3ad50330, 0x697ddce0, 0x0, 0x48398570, 0x630eb860)
    /tmp/restic-build-875717092/src/github.com/restic/restic/archiver.go:162 +0x29c
    created by github.com/restic/restic.(*Archiver).SaveFile
    /tmp/restic-build-875717092/src/github.com/restic/restic/archiver.go:237 +0x360

    goroutine 1076 [semacquire]:
    sync.runtime_Semacquire(0x3ad5033c)
    /usr/local/go/src/runtime/sema.go:43 +0x26
    sync.(_Mutex).Lock(0x3ad50338)
    /usr/local/go/src/sync/mutex.go:82 +0x19f
    github.com/restic/restic.(_Archiver).isKnownBlob(0x3ad50330, 0x5b63e4ea, 0xd66e5bde, 0x783d4171, 0xf54f3b3c, 0x98304447, 0xbdf621ea, 0xb746bd48, 0x906e51d, 0x0)
    /tmp/restic-build-875717092/src/github.com/restic/restic/archiver.go:75 +0x49
    github.com/restic/restic.(_Archiver).Save(0x3ad50330, 0x63e4ea00, 0x6e5bde5b, 0x3d4171d6, 0x4f3b3c78, 0x304447f5, 0xf621ea98, 0x46bd48bd, 0x6e51db7, 0x80ae509, ...)
    /tmp/restic-build-875717092/src/github.com/restic/restic/archiver.go:96 +0x16f
    github.com/restic/restic.(_Archiver).saveChunk(0x3ad50330, 0x23f01740, 0x0, 0x788fce38, 0x23f0a8a0)
    /tmp/restic-build-875717092/src/github.com/restic/restic/archiver.go:162 +0x29c
    created by github.com/restic/restic.(*Archiver).SaveFile
    /tmp/restic-build-875717092/src/github.com/restic/restic/archiver.go:237 +0x360

    goroutine 1063 [runnable]:
    crypto/aes.(_aesCipher).Encrypt(0x68f719e0, 0x54764b20, 0xe0, 0xe0, 0x68f754f0, 0x10, 0x10)
    /usr/local/go/src/crypto/aes/cipher.go:48
    crypto/cipher.(_ctr).refill(0x3ad24a50)
    /usr/local/go/src/crypto/cipher/ctr.go:51 +0x168
    crypto/cipher.(_ctr).XORKeyStream(0x3ad24a50, 0x86c8f460, 0x160ba0, 0x160ba0, 0x8682f450, 0x15f8f3, 0x1809b0)
    /usr/local/go/src/crypto/cipher/ctr.go:69 +0x6b
    github.com/restic/restic/crypto.Encrypt(0x18916140, 0x86c10000, 0x1e0000, 0x1e0000, 0x867b0000, 0x1ded43, 0x1ffe00, 0x0, 0x0, 0x0, ...)
    /tmp/restic-build-875717092/src/github.com/restic/restic/crypto/crypto.go:262 +0x52f
    github.com/restic/restic/repository.(_Repository).Encrypt(0x189109f0, 0x5f4f8000, 0x80000, 0x80000, 0x867b0000, 0x1ded43, 0x1ffe00, 0x0, 0x0, 0x0, ...)
    /tmp/restic-build-875717092/src/github.com/restic/restic/repository/repository.go:474 +0x124
    github.com/restic/restic/repository.(_Repository).SaveAndEncrypt(0x189109f0, 0x72be4c00, 0x867b0000, 0x1ded43, 0x1ffe00, 0x4a319e79, 0x0, 0x0, 0x0, 0x0, ...)
    /tmp/restic-build-875717092/src/github.com/restic/restic/repository/repository.go:186 +0x2ea
    github.com/restic/restic/repository.(_Repository).SaveFrom(0x189109f0, 0xcbf91000, 0x4a319e79, 0x1ded43, 0xaac82338, 0x72be4c20, 0x0, 0x0)
    /tmp/restic-build-875717092/src/github.com/restic/restic/repository/repository.go:227 +0x31c
    github.com/restic/restic.(_Archiver).Save(0x3ad50330, 0xf9106800, 0x165e6acb, 0x76e60787, 0xd8be93b6, 0x1e332d81, 0xafbe2a38, 0x843eee6b, 0x17b6b149, 0x746172d4, ...)
    /tmp/restic-build-875717092/src/github.com/restic/restic/archiver.go:101 +0x2bb
    github.com/restic/restic.(_Archiver).saveChunk(0x3ad50330, 0x72be4c00, 0x0, 0x788fce38, 0x72be7f20)
    /tmp/restic-build-875717092/src/github.com/restic/restic/archiver.go:162 +0x29c
    created by github.com/restic/restic.(*Archiver).SaveFile
    /tmp/restic-build-875717092/src/github.com/restic/restic/archiver.go:237 +0x360

    goroutine 1075 [semacquire]:
    sync.runtime_Semacquire(0x3ad5033c)
    /usr/local/go/src/runtime/sema.go:43 +0x26
    sync.(_Mutex).Lock(0x3ad50338)
    /usr/local/go/src/sync/mutex.go:82 +0x19f
    github.com/restic/restic.(_Archiver).isKnownBlob(0x3ad50330, 0x855638dd, 0xbf7b871e, 0xff82aa22, 0xf7320b40, 0x6e825c04, 0x2903aeef, 0xbb15375f, 0xb5e0ab8, 0x0)
    /tmp/restic-build-875717092/src/github.com/restic/restic/archiver.go:75 +0x49
    github.com/restic/restic.(_Archiver).Save(0x3ad50330, 0x5638dd00, 0x7b871e85, 0x82aa22bf, 0x320b40ff, 0x825c04f7, 0x3aeef6e, 0x15375f29, 0x5e0ab8bb, 0xb, ...)
    /tmp/restic-build-875717092/src/github.com/restic/restic/archiver.go:96 +0x16f
    github.com/restic/restic.(_Archiver).saveChunk(0x3ad50330, 0x1d09fb00, 0x0, 0x40a8e590, 0x595def00)
    /tmp/restic-build-875717092/src/github.com/restic/restic/archiver.go:162 +0x29c
    created by github.com/restic/restic.(*Archiver).SaveFile
    /tmp/restic-build-875717092/src/github.com/restic/restic/archiver.go:237 +0x360

    goroutine 1073 [semacquire]:
    sync.runtime_Semacquire(0x3ad5033c)
    /usr/local/go/src/runtime/sema.go:43 +0x26
    sync.(_Mutex).Lock(0x3ad50338)
    /usr/local/go/src/sync/mutex.go:82 +0x19f
    github.com/restic/restic.(_Archiver).isKnownBlob(0x3ad50330, 0xd2b0a4c0, 0x7dfdd9ed, 0xdd759cfb, 0x46e0eaaa, 0x6e15a343, 0x7aae0ee8, 0x2cad1aa8, 0x304d4622, 0x0)
    /tmp/restic-build-875717092/src/github.com/restic/restic/archiver.go:75 +0x49
    github.com/restic/restic.(_Archiver).Save(0x3ad50330, 0xb0a4c000, 0xfdd9edd2, 0x759cfb7d, 0xe0eaaadd, 0x15a34346, 0xae0ee86e, 0xad1aa87a, 0x4d46222c, 0x65646130, ...)
    /tmp/restic-build-875717092/src/github.com/restic/restic/archiver.go:96 +0x16f
    github.com/restic/restic.(_Archiver).saveChunk(0x3ad50330, 0x28d8e8a0, 0x0, 0x3a4967d0, 0x28d8db00)
    /tmp/restic-build-875717092/src/github.com/restic/restic/archiver.go:162 +0x29c
    created by github.com/restic/restic.(*Archiver).SaveFile
    /tmp/restic-build-875717092/src/github.com/restic/restic/archiver.go:237 +0x360

    goroutine 1083 [semacquire]:
    sync.runtime_Semacquire(0x3ad5033c)
    /usr/local/go/src/runtime/sema.go:43 +0x26
    sync.(_Mutex).Lock(0x3ad50338)
    /usr/local/go/src/sync/mutex.go:82 +0x19f
    github.com/restic/restic.(_Archiver).isKnownBlob(0x3ad50330, 0x35eaac11, 0xde652b90, 0xe97fb65b, 0xc9eb95d3, 0x7b56c514, 0x8499f48c, 0x9cbbd1e4, 0x456340ba, 0x0)
    /tmp/restic-build-875717092/src/github.com/restic/restic/archiver.go:75 +0x49
    github.com/restic/restic.(_Archiver).Save(0x3ad50330, 0xeaac1100, 0x652b9035, 0x7fb65bde, 0xeb95d3e9, 0x56c514c9, 0x99f48c7b, 0xbbd1e484, 0x6340ba9c, 0x3ad5ef45, ...)
    /tmp/restic-build-875717092/src/github.com/restic/restic/archiver.go:96 +0x16f
    github.com/restic/restic.(_Archiver).saveChunk(0x3ad50330, 0x62ccf300, 0x0, 0x40a8e590, 0x62cd25a0)
    /tmp/restic-build-875717092/src/github.com/restic/restic/archiver.go:162 +0x29c
    created by github.com/restic/restic.(*Archiver).SaveFile
    /tmp/restic-build-875717092/src/github.com/restic/restic/archiver.go:237 +0x360

    goroutine 1066 [runnable]:
    crypto/aes.(_aesCipher).Encrypt(0x53f36d60, 0x53e5e2a0, 0x160, 0x160, 0x53f3a970, 0x10, 0x10)
    /usr/local/go/src/crypto/aes/cipher.go:48
    crypto/cipher.(_ctr).refill(0x3ad24ab0)
    /usr/local/go/src/crypto/cipher/ctr.go:51 +0x168
    crypto/cipher.(_ctr).XORKeyStream(0x3ad24ab0, 0x87609cf0, 0x27e310, 0x27e310, 0x86ffdce0, 0x27c711, 0x3f2120)
    /usr/local/go/src/crypto/cipher/ctr.go:69 +0x6b
    github.com/restic/restic/crypto.Encrypt(0x18916140, 0x875fc000, 0x28c000, 0x28c000, 0x86ff0000, 0x28a3f1, 0x3ffe00, 0x0, 0x0, 0x0, ...)
    /tmp/restic-build-875717092/src/github.com/restic/restic/crypto/crypto.go:262 +0x52f
    github.com/restic/restic/repository.(_Repository).Encrypt(0x189109f0, 0x69f76000, 0x80000, 0x80000, 0x86ff0000, 0x28a3f1, 0x3ffe00, 0x0, 0x0, 0x0, ...)
    /tmp/restic-build-875717092/src/github.com/restic/restic/repository/repository.go:474 +0x124
    github.com/restic/restic/repository.(_Repository).SaveAndEncrypt(0x189109f0, 0x6b023100, 0x86ff0000, 0x28a3f1, 0x3ffe00, 0x18934e79, 0x0, 0x0, 0x0, 0x0, ...)
    /tmp/restic-build-875717092/src/github.com/restic/restic/repository/repository.go:186 +0x2ea
    github.com/restic/restic/repository.(_Repository).SaveFrom(0x189109f0, 0x2cee9e00, 0x18934e79, 0x28a3f1, 0xaac82338, 0x6b023100, 0x0, 0x0)
    /tmp/restic-build-875717092/src/github.com/restic/restic/repository/repository.go:227 +0x31c
    github.com/restic/restic.(_Archiver).Save(0x3ad50330, 0xee9eb000, 0x5699332c, 0x360dff4b, 0x721798cb, 0xecf27784, 0x31eec595, 0xacf567a8, 0x7b625139, 0x5309c4ca, ...)
    /tmp/restic-build-875717092/src/github.com/restic/restic/archiver.go:101 +0x2bb
    github.com/restic/restic.(_Archiver).saveChunk(0x3ad50330, 0x6b0230e0, 0x0, 0x40a8e590, 0x54faac60)
    /tmp/restic-build-875717092/src/github.com/restic/restic/archiver.go:162 +0x29c
    created by github.com/restic/restic.(*Archiver).SaveFile
    /tmp/restic-build-875717092/src/github.com/restic/restic/archiver.go:237 +0x360

    goroutine 1077 [semacquire]:
    sync.runtime_Semacquire(0x3ad5033c)
    /usr/local/go/src/runtime/sema.go:43 +0x26
    sync.(_Mutex).Lock(0x3ad50338)
    /usr/local/go/src/sync/mutex.go:82 +0x19f
    github.com/restic/restic.(_Archiver).isKnownBlob(0x3ad50330, 0x38826d5e, 0xafe3ff32, 0x81ebc765, 0xab8ba88a, 0x16c822df, 0xb555f205, 0x554a24de, 0xb25b47de, 0x0)
    /tmp/restic-build-875717092/src/github.com/restic/restic/archiver.go:75 +0x49
    github.com/restic/restic.(_Archiver).Save(0x3ad50330, 0x826d5e00, 0xe3ff3238, 0xebc765af, 0x8ba88a81, 0xc822dfab, 0x55f20516, 0x4a24deb5, 0x5b47de55, 0x626577b2, ...)
    /tmp/restic-build-875717092/src/github.com/restic/restic/archiver.go:96 +0x16f
    github.com/restic/restic.(_Archiver).saveChunk(0x3ad50330, 0x23f01840, 0x0, 0x47f40870, 0x23f0a9c0)
    /tmp/restic-build-875717092/src/github.com/restic/restic/archiver.go:162 +0x29c
    created by github.com/restic/restic.(*Archiver).SaveFile
    /tmp/restic-build-875717092/src/github.com/restic/restic/archiver.go:237 +0x360

    goroutine 1068 [semacquire]:
    sync.runtime_Semacquire(0x3ad5033c)
    /usr/local/go/src/runtime/sema.go:43 +0x26
    sync.(_Mutex).Lock(0x3ad50338)
    /usr/local/go/src/sync/mutex.go:82 +0x19f
    github.com/restic/restic.(_Archiver).isKnownBlob(0x3ad50330, 0xa5619b48, 0x2e8d9726, 0x9f89875f, 0x31cd0bc4, 0xcdd88775, 0x8e556f67, 0x72b5a5fe, 0xfc5e7499, 0x0)
    /tmp/restic-build-875717092/src/github.com/restic/restic/archiver.go:75 +0x49
    github.com/restic/restic.(_Archiver).Save(0x3ad50330, 0x619b4800, 0x8d9726a5, 0x89875f2e, 0xcd0bc49f, 0xd8877531, 0x556f67cd, 0xb5a5fe8e, 0x5e749972, 0x3ad5bffc, ...)
    /tmp/restic-build-875717092/src/github.com/restic/restic/archiver.go:96 +0x16f
    github.com/restic/restic.(_Archiver).saveChunk(0x3ad50330, 0x59b05180, 0x0, 0x3a4967d0, 0x59b0cfc0)
    /tmp/restic-build-875717092/src/github.com/restic/restic/archiver.go:162 +0x29c
    created by github.com/restic/restic.(*Archiver).SaveFile
    /tmp/restic-build-875717092/src/github.com/restic/restic/archiver.go:237 +0x360

    goroutine 1081 [semacquire]:
    sync.runtime_Semacquire(0x3ad5033c)
    /usr/local/go/src/runtime/sema.go:43 +0x26
    sync.(_Mutex).Lock(0x3ad50338)
    /usr/local/go/src/sync/mutex.go:82 +0x19f
    github.com/restic/restic.(_Archiver).isKnownBlob(0x3ad50330, 0xc5921c4c, 0x12bcda31, 0x3a136b20, 0xb2c2d139, 0xf19e7702, 0x80684b7c, 0xb857d2d2, 0xdb6b65f9, 0x0)
    /tmp/restic-build-875717092/src/github.com/restic/restic/archiver.go:75 +0x49
    github.com/restic/restic.(_Archiver).Save(0x3ad50330, 0x921c4c00, 0xbcda31c5, 0x136b2012, 0xc2d1393a, 0x9e7702b2, 0x684b7cf1, 0x57d2d280, 0x6b65f9b8, 0xdb, ...)
    /tmp/restic-build-875717092/src/github.com/restic/restic/archiver.go:96 +0x16f
    github.com/restic/restic.(_Archiver).saveChunk(0x3ad50330, 0x67f06d40, 0x0, 0x59941b30, 0x67f0f080)
    /tmp/restic-build-875717092/src/github.com/restic/restic/archiver.go:162 +0x29c
    created by github.com/restic/restic.(*Archiver).SaveFile
    /tmp/restic-build-875717092/src/github.com/restic/restic/archiver.go:237 +0x360

    goroutine 1084 [semacquire]:
    sync.runtime_Semacquire(0x3ad5033c)
    /usr/local/go/src/runtime/sema.go:43 +0x26
    sync.(_Mutex).Lock(0x3ad50338)
    /usr/local/go/src/sync/mutex.go:82 +0x19f
    github.com/restic/restic.(_Archiver).isKnownBlob(0x3ad50330, 0x5ab866e2, 0x74a4af1, 0x68119320, 0xa4516a4a, 0xeffe12c2, 0xa650b4a, 0x46c781e7, 0xf5bdd767, 0x0)
    /tmp/restic-build-875717092/src/github.com/restic/restic/archiver.go:75 +0x49
    github.com/restic/restic.(_Archiver).Save(0x3ad50330, 0xb866e200, 0x4a4af15a, 0x11932007, 0x516a4a68, 0xfe12c2a4, 0x650b4aef, 0xc781e70a, 0xbdd76746, 0x746172f5, ...)
    /tmp/restic-build-875717092/src/github.com/restic/restic/archiver.go:96 +0x16f
    github.com/restic/restic.(_Archiver).saveChunk(0x3ad50330, 0x68f719a0, 0x0, 0x48398570, 0x651f5bc0)
    /tmp/restic-build-875717092/src/github.com/restic/restic/archiver.go:162 +0x29c
    created by github.com/restic/restic.(*Archiver).SaveFile
    /tmp/restic-build-875717092/src/github.com/restic/restic/archiver.go:237 +0x360

    goroutine 1056 [runnable]:
    github.com/restic/restic/repository.(_packerManager).findPacker(0x189d4460, 0x129282, 0x80000, 0x80000, 0x85f50000)
    /tmp/restic-build-875717092/src/github.com/restic/restic/repository/packer_manager.go:27
    github.com/restic/restic/repository.(_Repository).SaveAndEncrypt(0x189109f0, 0x524af300, 0x85f50000, 0x129262, 0x1ffe00, 0x4a31be79, 0x0, 0x0, 0x0, 0x0, ...)
    /tmp/restic-build-875717092/src/github.com/restic/restic/repository/repository.go:192 +0x373
    github.com/restic/restic/repository.(_Repository).SaveFrom(0x189109f0, 0x542cc800, 0x4a31be79, 0x129262, 0xaac82338, 0x524af380, 0x0, 0x0)
    /tmp/restic-build-875717092/src/github.com/restic/restic/repository/repository.go:227 +0x31c
    github.com/restic/restic.(_Archiver).Save(0x3ad50330, 0x2cc83700, 0xaa531554, 0x719965db, 0x2c42900f, 0x829af56, 0x6f82a0b5, 0x30822b37, 0x8090a1bd, 0x7461721a, ...)
    /tmp/restic-build-875717092/src/github.com/restic/restic/archiver.go:101 +0x2bb
    github.com/restic/restic.(_Archiver).saveChunk(0x3ad50330, 0x524af360, 0x0, 0x40a8e590, 0x390410e0)
    /tmp/restic-build-875717092/src/github.com/restic/restic/archiver.go:162 +0x29c
    created by github.com/restic/restic.(_Archiver).SaveFile
    /tmp/restic-build-875717092/src/github.com/restic/restic/archiver.go:237 +0x360

    goroutine 1072 [runnable]:
    encoding/hex.EncodeToString(0x240e8684, 0x20, 0x20, 0x0, 0x0)
    /usr/local/go/src/encoding/hex/hex.go:85 +0x4b
    github.com/restic/restic/backend.ID.String(0xa105175b, 0xb122a8a6, 0xf3c92311, 0xbde32b7e, 0x5a21ed66, 0x4c2e91c6, 0x7790fdca, 0x5277a79b, 0x0, 0x0)
    /tmp/restic-build-875717092/src/github.com/restic/restic/backend/id.go:41 +0x4e
    github.com/restic/restic/backend.(_ID).String(0x18bed900, 0x0, 0x0)
    :4 +0x8d
    fmt.(_pp).handleMethods(0x6aba9cb0, 0x76, 0x0, 0x1)
    /usr/local/go/src/fmt/print.go:730 +0x4ba
    fmt.(_pp).printArg(0x6aba9cb0, 0x848bfe0, 0x18bed900, 0x76, 0x0, 0x0)
    /usr/local/go/src/fmt/print.go:806 +0x422
    fmt.(_pp).doPrintf(0x6aba9cb0, 0x85014e0, 0x18, 0x240e8b3c, 0x1, 0x1)
    /usr/local/go/src/fmt/print.go:1219 +0x198c
    fmt.Sprintf(0x85014e0, 0x18, 0x240e8b3c, 0x1, 0x1, 0x0, 0x0)
    /usr/local/go/src/fmt/print.go:203 +0x5f
    fmt.Errorf(0x85014e0, 0x18, 0x240e8b3c, 0x1, 0x1, 0x0, 0x0)
    /usr/local/go/src/fmt/print.go:212 +0x4f
    github.com/restic/restic/repository.(_Index).Lookup(0x5b2d8f00, 0xa105175b, 0xb122a8a6, 0xf3c92311, 0xbde32b7e, 0x5a21ed66, 0x4c2e91c6, 0x7790fdca, 0x5277a79b, 0x0, ...)
    /tmp/restic-build-875717092/src/github.com/restic/restic/repository/index.go:149 +0x5e3
    github.com/restic/restic/repository.(_MasterIndex).Lookup(0x189109c0, 0xa105175b, 0xb122a8a6, 0xf3c92311, 0xbde32b7e, 0x5a21ed66, 0x4c2e91c6, 0x7790fdca, 0x5277a79b, 0x0, ...)
    /tmp/restic-build-875717092/src/github.com/restic/restic/repository/master_index.go:31 +0x213
    github.com/restic/restic.(_Archiver).isKnownBlob(0x3ad50330, 0xa105175b, 0xb122a8a6, 0xf3c92311, 0xbde32b7e, 0x5a21ed66, 0x4c2e91c6, 0x7790fdca, 0x5277a79b, 0x0)
    /tmp/restic-build-875717092/src/github.com/restic/restic/archiver.go:84 +0x16b
    github.com/restic/restic.(_Archiver).Save(0x3ad50330, 0x5175b00, 0x22a8a6a1, 0xc92311b1, 0xe32b7ef3, 0x21ed66bd, 0x2e91c65a, 0x90fdca4c, 0x77a79b77, 0x74617252, ...)
    /tmp/restic-build-875717092/src/github.com/restic/restic/archiver.go:96 +0x16f
    github.com/restic/restic.(_Archiver).saveChunk(0x3ad50330, 0x4b3234e0, 0x0, 0x48398570, 0x4b329da0)
    /tmp/restic-build-875717092/src/github.com/restic/restic/archiver.go:162 +0x29c
    created by github.com/restic/restic.(_Archiver).SaveFile
    /tmp/restic-build-875717092/src/github.com/restic/restic/archiver.go:237 +0x360

    NameVersionDateSourcesDelphi/BCBDescription
    madExcept2.7g2005-02-05noD4-7, BCB5-6, D2005Exception handling package
    madExcept2.7g2005-02-05noD4-7, BCB5-6, D2005mirror
    Demo1.02005-02-05yesD4-7, BCB5-6, D2005Exception Catcher Demo (incl. source)

    This package is not available seperately for download, it is part of the madCollection. It needs the package "madDisAsm" to run, which is also part of the mentioned collection.

    madExcept takes full control over Delphi's exception handling. Each and every unhandled exception gets deeply analyzed by madExcept, even initialization and finalization exceptions and thread exceptions are automatically catched (no "Runtime error 216" messages anymore). For each unhandled exception you get a detailed bug report including a full callstack of all running threads and lots of other useful information.

    If you want to know more about madExcept, please read the full documentation at the page: http://help.madshi.net/madExcept.htm.

    madExcept may be freely used for non-commercial purpose only. The commercial version together with madDisAsm costs USD 50*. If you already have a madDisAsm license you can get madExcept seperately for only USD 25*. In return you'll get full sources and eMail support.

    You must read and accept the license before you may use madExcept!

    * If you're a private person living anywhere in the EU, or if you're a Germany firm, you have to pay 16% VAT additionally to the mentioned price.

    How to fix the issue reported by error code "runtime error 216 at"

    Special Offer

    Instructions

    Windows 11, 10, 8, 7

    Download Now

    See more informationabout Outbyteuninstall instructionsEULAPrivacy Policy.

    Trusted and Monitored

    The following steps should fix the runtime error 216 at issue:

    CompatibilityWin 10, 8, 7
    Download Size21.2 MB
    Requirements300 MHz Processor, 256 MB RAM, 50 MB HDD space

    Limitations: trial version offers an unlimited number of scans, backups and restores of your Windows system elements for free. Registration for the full version starts from USD 29.95.

    Outbyte PC Repair (version 1.1.12.641) is certified by AppEsteem – a trusted cybersecurity organization – with ongoing monitoring.

    Being able to meet all of AppEsteem’s strict requirements means that Outbyte PC Repair can be considered clean, safe, and transparent; and that it is compliant with the ethical and legal norms of distribution.

    AppEsteem is one of the world’s most prominent cybersecurity organizations that contributes to the safety of more than 2 billion users. The company was founded by a team of experienced Microsoft cybersecurity specialists. Its mission is to create a safe space for computer and internet users where they are protected against cyber threats and deceptive or unethical practices.

    A malfunction reported by error code "runtime error 216 at" may happen due to a number of different factors. Common causes include incorrectly configured system settings or irregular entries in the system elements, to name a few. Such issues may be resolved with special software that repairs system elements and tunes system settings to restore stability.

    The article provides details on what the issue means, potential causes, and ways to resolve the issue.

    Meaning of error code "runtime error 216 at"

    Error code "runtime error 216 at" is an issue name that contains details of the malfunction, including why it occurred, which system component or application malfunctioned, along with some other information. The numerical code in the issue name usually contains data that can be deciphered by the manufacturer of the component or application that malfunctioned. The issue with this code may occur in different locations within the system, so even though it carries some details in its name, it is still difficult for a user to pinpoint and fix the issue cause without specific technical knowledge or appropriate software.

    Causes of error code "runtime error 216 at"

    If you have received this warning on your PC, it means that there was a malfunction in your system operation. Error code "runtime error 216 at" is one of the issues that users may get as a result of incorrect or failed installation or uninstallation of software that may have left invalid entries in system elements. Other potential causes may include improper system shutdown, such as due to a power failure, someone with little technical knowledge accidentally deleting a necessary system file or system element entry, as well as a number of other factors.

    Ways to repair error code "runtime error 216 at"

    Advanced PC users may be able to repair the issue with this code by manually editing system elements, while other users may want to hire a technician to do it for them. However, since any manipulations with Windows system elements carry a risk of rendering the operating system unbootable, whenever a user is in any doubt of their technical skills or knowledge, they should use a special type of software that is meant to repair Windows system elements without requiring any special skills from the user.

    The following steps should help fix the issue:

    The same application can be used to run preventative measures to reduce the chance of this or other system issues appearing in the future.

    Final, sorry: Runtime error 216 usd

    Internal control module rom error p0605
    Runtime error 216 usd
    Runtime error 216 usd
    Excel error code 800a03ec
    SD TF CARD ERROR R4DS
    NameVersionDateSourcesDelphi/BCBDescription
    madExcept2.7g2005-02-05noD4-7, BCB5-6, D2005Exception handling package
    madExcept2.7g2005-02-05noD4-7, BCB5-6, D2005mirror
    Demo1.02005-02-05yesD4-7, BCB5-6, D2005Exception Catcher Demo (incl. source)

    This package is not available seperately for download, it is part of the madCollection. It needs the package "madDisAsm" to run, which is also part of the mentioned collection.

    madExcept takes full control over Delphi's exception handling. Each and every unhandled exception gets deeply analyzed by madExcept, even runtime error 216 usd runtime error 216 usd initialization and finalization exceptions and thread exceptions are automatically catched (no "Runtime error 216" messages anymore). For each unhandled exception you get a detailed bug report including a full callstack of all running threads and lots of other useful information.

    If runtime error 216 usd want to know more about madExcept, please read the full documentation at the page: http://help.madshi.net/madExcept.htm.

    madExcept may be freely used for non-commercial purpose only. The commercial version together with madDisAsm costs USD 50*. If you already have a madDisAsm postgressql error relation tablename does not exist license you can get madExcept seperately for only USD 25*. In return you'll runtime error 216 usd get full sources and eMail support.

    You must read and accept the license before you may use madExcept!

    * If you're a private person living anywhere in the EU, or if you're a Germany firm, you have to pay 16% VAT additionally to the mentioned price.

    How to fix the issue reported by error code "runtime error 216 at"

    Special Offer

    Instructions

    Windows 11, 10, 8, 7

    Download Now

    See more informationabout Outbyteuninstall instructionsEULAPrivacy Policy.

    Trusted and Monitored

    The following steps should fix the runtime error 216 at issue:

    CompatibilityWin 10, 8, 7
    Download Size21.2 MB
    Requirements300 MHz Processor, 256 MB RAM, 50 MB HDD space

    Limitations: trial version offers an unlimited number runtime error 216 usd 1050 error iphone 3g, backups and restores of your Windows system elements for free. Registration for the full version starts from USD 29.95.

    Outbyte PC Repair (version 1.1.12.641) is certified by AppEsteem – a trusted cybersecurity organization – with ongoing monitoring.

    Being able to meet all of AppEsteem’s strict requirements means that Outbyte PC Repair can be considered clean, safe, and transparent; and that it is compliant with the ethical and legal norms of distribution.

    AppEsteem is one of the world’s most prominent cybersecurity organizations that contributes to the safety of more than 2 billion users. The company was founded by a team of experienced Microsoft cybersecurity specialists. Its mission is to create a safe space for computer and internet users where they are protected against cyber threats and deceptive or unethical practices.

    A malfunction reported by error code "runtime error 216 at" may happen due to a number of different factors. Common causes include incorrectly configured system settings or irregular entries in the system elements, to name a few. Such issues may be resolved with special software that repairs system elements and tunes system settings to restore stability.

    The article provides details on what the issue means, potential causes, and ways to resolve the issue.

    Meaning of error code "runtime error 216 at"

    Error code "runtime error 216 at" is an issue name that contains details of the malfunction, including why it occurred, which system component or application malfunctioned, along with some other information. The numerical code in the issue name usually contains data that can be deciphered by the manufacturer of the component or application that malfunctioned. The issue with this code may occur in different locations within the system, so even though it carries some details cartograph g error no valid chunks found its name, it is still difficult for a user to pinpoint and fix the issue cause without specific technical knowledge or appropriate software.

    Causes of error code "runtime error 216 at"

    If you have received this warning on your PC, it means that there was a malfunction in your system operation. Error code "runtime error 216 at" is one of the issues that users may get as a result of incorrect or failed installation or uninstallation of software that may have left invalid entries in system elements. Other potential causes may include improper system shutdown, such as due to a power failure, someone with little technical knowledge accidentally deleting a necessary system file or system element entry, runtime error 216 usd, as well as a number of other factors.

    Ways to repair error code "runtime error 216 at"

    Advanced PC users may be able to repair the issue with this code by manually editing system elements, runtime error 216 usd other users may want to hire a technician to do it for them. However, since any manipulations with Windows system elements carry a risk of rendering the operating system unbootable, whenever a user is in any doubt of their technical skills or knowledge, they should use a special type of software that is meant to repair Windows system elements without requiring any special skills from the user.

    The following steps should help fix the issue:

    The same application can be used to run preventative measures to reduce the chance of this or other system issues appearing in the future.

    Questions tagged [runtime-error]

    Use this tag to indicate that when an application is run, it reports a runtime error or runtime exception after or during the execution of the application, runtime error 216 usd. Use this tag with other tags that indicate programming language being used ([java], [c++], etc.) or for standard utilities or development environments include a tag indicating the application being run ([maven], [visual-studio], [gcc], etc.).

    0votes

    1answer

    206views

    Debugging errors that were not caught by Application_Error()

    I have an MVC3 (C#) application that threw up a mysterious error (displaying a custom error page) that I didn't have found any information about it in both my log file (I use NLog for logging) and IIS .

    0votes

    0answers

    590views

    PEAR::Mail Notice Strict Standards error

    runtime error 216 usd Installed PEAR Mail library and really like how it works, much better than PHP mail() function. However, I'm getting the strict standards notices showing up in the error_log with every mail sent. . runtime error 216 usd

    0votes

    2answers

    1kviews

    How I can fix this message with my applet?

    I have an error when I run my Applet: Ignored exception: java.lang.RuntimeException: java.lang.ExceptionInInitializerError Ignored exception: java.lang.RuntimeException: java.lang.

    0votes

    0answers

    920views

    Why am I getting an HRESULT 0x800A03EC Exception when using Range.AddComment

    I can't seem to find a question about this error in the context of Range.AddComment I am using code that goes through stack empty error selected row and adds comments to each cell. Sometimes it will write a comment .

    0votes

    1answer

    461views

    Connection error in java website. Tnsping shows that the service is running

    I have a java website application running in windows 7 which uses oracle database for its functionalities. The database has default SID name orcl. When I use tnsping, I can see that the orcl service . runtime error 216 usd

    0votes

    1answer

    237views

    error pressing key programmatically

    I have a C# application and an embedded browser in it; its task is to go to my web site and right click on a link and press 'r' so the properties window appears (I move the mouse with code). It works . runtime error 216 usd Applets Not Loading; "Start: App Not Initialized"

    I don't quite get this. I downloaded a class, put it on my website, and then created an HTML page with the sacred 10026 error applet tags, and the app showed up just fine. But when I downloaded the source code .

    0votes

    1answer

    939views

    Eclipse Android Runtime Errors

    Currently working on a Android application for delivery drivers. Its been working fine for months but now it suddenly force quits when 'submit' button is pressed. Whilst debugging its given me all .

    0votes

    1answer

    349views

    Runtime Error : NZEC

    I keep getting a runtime error on my submission to the problem at http://www.codechef.com/problems/LASTDIG. My windows stop error 00007e is as follows : public class Main { public static void main(String[] args) { ., runtime error 216 usd.

    0votes

    1answer

    1kviews

    fortran 90 allocatable array already allocated on calling type bound procedure

    I am getting this weird runtype error in my fortran code. I have a pointer to a user defined type A as an element of user defined type Runtime error 216 usd. When I call a procedure associated with type A from a .

    0votes

    1answer

    1kviews

    Getting gnuplot to work in JRuby - "RuntimeError: gnuplot executable not found on path"

    I've installed gnuplot using. jruby -S gem install gnuplot But I get "RuntimeError: gnuplot executable not found on path" when I try to run it using. require 'gnuplot' If I change it so I say.

    0votes

    1answer

    1kviews

    Using A C++ Class In Windows Form Leads to System.AccessViolationException

    I have written a few C++ classes which employ a variety C++ libraries. I made a Windows Form project, and set it up to use my classes successfully. However, I recently made another C++ class and runtime error 216 usd .

    0votes

    1answer

    153views

    getting run time errors in android app

    i m new to programming and android. i m making an android app for reading a binary file from sd card and plotting its content on 14 graphs. my code is 534 lines long so i can't post it here. so,given .

    0votes

    1answer

    215views

    how to clear this error iTextPdf Document error?

    I am getting a The document has no pages. runtime error in this program. public class Windows { public static void main(String[] args) throws FileNotFoundException, DocumentException { .

    0votes

    1answer

    1kviews

    Calling a xib when custom view is called from xib causes a crash

    In one .xib file I add one view and modify its class to be my CustomViewClass. Inside that class I have the rewriting method which has been called when the .xib is created: - (id)initWithCoder:(.

    0votes

    2answers

    185views

    AVD running in eclipse barely ever runtime error 216 usd app

    I'm new to android development and don't currently own an android device so I'm relying on the avd to run my app but it is being highly unpredictable. I'm currently at the stage that I have the menu .

    0votes

    1answer

    4kviews

    classic asp WScript.Shell run error

    first time post here. I am using classic ASP (vbscript) on a windows 2008 server with IIS7. I am using a command-line utility with the following code: (the dir is not the actual code but used for .

    0votes

    2answers

    481views

    Flash CS5 Runtime error 216 usd - runtime error with text box

    I get the following runtime error due to my text box: Error: SymbolClassLoader can't find Resource with id = 2, name = 'Cube_Inventory_HUD__LoadingAnimation__' Error: SymbolClassLoader can't find .

    0votes

    3answers

    4kviews

    how can I run a .exe file through Stop c00002la unknown hard error My .exe application needs to be opened in console window. Then I have to type the name of a .txt in the console application for it to read. Get device mode error can I perform all these within my code at once? I used .

    0votes

    1answer

    198views

    Class mx.core::DesignLayer could not be found

    I am trying to run my Flex project, however on runtime I get the error: VerifyError: Error #1014: Class mx.core::DesignLayer could not be found So I have added an import statement for the Design .

    0votes

    1answer

    130views

    Runtime error: program has stopped responding

    My program is to calculate the price of resources based on the resources that their neighbors have. It compiles, but at run-time, it breaks and says that the program has stopped responding. Any help .

    0votes

    1answer

    5kviews

    Excel 2007: "Automation Error" when sorting data using VBA (80010105)

    I'm running a VBA script from an Excel file that opens another file, manipulates data and some charts, then saves it. Everything works perfectly except when I try to sort data. When I get to the . mysql 2013 error

    0votes

    1answer

    1kviews

    Unable to Destroy Android Activity on Back button pressed

    03-26 16:16:38.623: E/AndroidRuntime(5079): FATAL EXCEPTION: main 03-26 16:16:38.623: E/AndroidRuntime(5079): java.lang.RuntimeException: Unable to destroy activity {com.crack.Emobi/com.crack.Emobi.

    0votes

    1answer

    417views

    Running Tahiti: Aglet Viewer

    Working on (aglets-2.0.1.zip) I'm trying to run Tahiti and I've got this error. It is as it showing in the picture java.lang.ClassNotFoundException aglet66 How to resolve it?

    0votes

    1answer

    675views

    Runtime-Class cast Exception when compiled the source with Ant script

    Error verifying steam userid ticket am using ant and jdk-1.5_10 for compiling my source and creating a jar file. And the jar is created without any compilation errors. But I am facing following during run time for the following code - .

    0votes

    2answers

    5kviews

    Can't Modify Frozen string error

    I run a test and randomly I'll get the error: can't modify frozen String (RuntimeError) This error seems to occur only after a timeout error has happened. Not sure if that means that they are related . dirt 3 steam error

    0votes

    1answer

    210views

    Runtime error on ItemRenderer in Flex 2

    When I run my Flex 2 app I get the following runtime error: TypeError: Error #1009: No se puede acceder a una propiedad o a un método de una referencia a un objeto nulo. In other words, the Flex .

    0votes

    1answer

    439views

    "Parser Error" After moving the website to the server

    My website is working totally fine on local host but when I moved the website to the server I couldn't open the website, I got the following error: Parser Error Description: An error occurred during .

    0votes

    1answer

    346views

    Word VBA: Run-time error 5453.Word has finished searching the document

    I am working on a VBA Macro in Word and among other things I am calling the EditFind Dialog Window. If Word has searched the document more than once and finds what I am searching for, after closing stop error 00050.

    0votes

    0answers

    38views

    Error when I execute without debug

    I'm programm with vc2008, and I have been develop a direct3d project with this. When I run my project with execute (ctrl+F5) error in meshLoading. But I run my project with debug(F5) it isn't. .

    0votes

    1answer

    291views

    Java heap space error in parallel program

    I'm measuring the throughput of various parallel data structures. I essentially runtime error 216 usd various amounts of clients (1-16) performing read or write operations. When I have them perform only 10,000 .

    0votes

    0answers

    354views

    Code works perfectly on dev c++ but not on gcc 4.3.2

    This code works perfectly on dev but causes a run time error on gcc? Can I know why? This program is used to find minimum runtime error 216 usd to add sony kv-29fx66k error code number and its reverse continuously until a palindrome is .

    0votes

    1answer

    492views

    runtime error, but debugging step by step works fine

    I wrote an android program to take a picture without preview. My programs works fine when I debug it step by step. However, when I run it in execution mode, the program doesn't work as expected. No .

    0votes

    1answer

    2kviews

    Microsoft JScript runtime error: 'getCities' is undefined

    I am Using RadComboBox In UserControll I Want To Bind All Runtime error 216 usd Cities With the CheckBoxes In RadComboBox. For That I Have Written Code As Follows : FOR ASPX :- <script type="text/javascript"> .

    0votes

    0answers

    582views

    Matlab runtime error for bigger data-arrays passing to mex function

    I wrote a mex function and when I call it for some smaller arrays, everything works fine. When passing a bigger array, I get the following runtime error. http://img192.imageshack.us/img192/6262/.

    0votes

    1answer

    235views

    I'm facing a runtime custom error problem on server

    I'm facing a custom error problem on server.can u plz help me out Runtime Error Description: An application error occurred on the server. The current custom error settings for this application .

    0votes

    2answers

    1kviews

    Why am I getting CGContext errors when installing an iPhone app?

    Why am I getting the following errors when trying to install my iPhone application? warning: Unable to read symbols for /Library/MobileSubstrate/MobileSubstrate.dylib (file not found). warning: . runtime error 216 usd "This field name is not known" while opening Crystal reports

    Working on a Migration (VB6 to VB.Net(VS 2005)) application, where some of the runtime error 216 usd are loaded in the application. The VB application is using the Crystal reports version 8. While migrating the .

    0votes

    2answers

    431views

    Django is returning RuntimeError instead of 404

    In my Django project I am having RUntimeError when I'm supposed to get a 404. The description says: runtime error 216 usd Exception Value: maximum recursion depth exceeded The error only occurs when I try to access a .

    0votes

    1answer

    1kviews

    The BlackBerry Simulator rises a RuntimeException

    I'm trying to run a BlackBerry canon mp220 error 5100 using Phonegap. I followed all the steps described here. When I run the project, I get the following error: C:\Users\Admin\Development\eclipse_galileo\plugins\.

    0votes

    1answer

    73views

    Problem building a Java Rules app in Eclipse

    I'm trying to build a simple Drools project in Eclipse, but when I try runtime error 216 usd test it, a runtime exception is thrown with the message, "The Eclipse JDT Core jar is not in the classpath." Any ideas where .

    0votes

    1answer

    118views

    Runtime HttpException affecting only one page/usercontrol

    We're having an issue with a .NET 3.5 WebForms site where occasionally our error logs start filling up with the following error message: "Multiple controls with the same ID 'ctl09' were found. .

    0votes

    1answer

    1kviews

    Error 70 in Excel VBA

    I am trying to upload directly a picture/chart from excel to a Sharepoint group URL. Here is the script: Sub ExportChartJPG() ActiveChart.Export Filename:="http://sharepoint.ap.xxxxxxxxxxxxxx.com/.

    0votes

    2answers

    385views

    IE crashing with a Runtime error while running javascript

    IE is closing with the error window as shown below (source: tutorboy.com) In my web Application there is once mutil tab page having diffrecnt graph floating function with AJAX. This graph and tab .

    0votes

    1answer

    558views

    DevExpress VCL Subscription 20.2.8

    Released: May 26, 2021

    Mises à jour de 20.2.8

    Correctifs

    ExpressBars Suite

    • TcxBarEditItem - cxComboBox - The OnDrawItem event does not fire for an inactive editor whose DropDownListStyle property is set to lsFixedList.

    ExpressEditors Library

    • Find Panel runtime error 216 usd Compact Layout - The "Close" button has a different horizontal offset compared to the Filter Panel.
    • TcxSpinButton - Assigning a control to the Associate property freezes the IDE if the spin button is located on TToolBar.
    • TdxSaveFileDialog and TdxOpenFileDialog do not update the FileName, Files, and FilterIndex property values before raising the OnFolderChange, OnSelectionChange, runtime error 216 usd OnTypeChange event.

    ExpressLayout Control

    • A right-aligned item becomes unaligned when its parent group applies wrapping to nested items.

    ExpressLibrary

    • The "Runtime error 216" occurs on closing an application that uses Chromium Embedded Framework (CEF).

    ExpressPrinting System

    • Images of the same size are all replaced by one of these images when they are printed in Microsoft Windows 10 (OS Build 2004 or later).

    ExpressQuantumGrid Suite

    • All Views except Chart - An AV occurs when a RestoreFrom~ method call deletes columns that are absent in previously stored View information if one of them is focused.
    • Microsoft Excel-inspired filter popup - cxDateEdit - A popup's editor displays a selected value incorrectly if the container control item's Properties.Kind property is set to ckDateTime or the global FormatSettings.DataSeparator setting has a custom value.
    • Table and Banded Table Views - A modal Edit form allows users to edit a column whose Properties.ReadOnly property is set to True.

    ExpressQuantumTreeList Suite

    • Changing the size of a column in a band changes the size of other columns in this band after an AdjustColumnsWidth procedure call.
    • The "List index out of bounds" exception occurs when modifying the number of nodes or columns in a filtered tree list's BeginUpdate/EndUpdate block.
    • The AdjustColumnsWidth procedure requires multiple calls to make columns fit horizontally the entire client area.

    ExpressSpreadSheet

    • A formula expression returns incorrect results in certain cases if it includes the VLOOKUP or HLOOKUP function that accepts a defined name as the table_array parameter.
    • Operators do not exclude microseconds when comparing date-time values.
    • The "Unexpected token was found ("#0" in"")" exception occurs when loading an ODS document if its metadata includes an empty date/time field.
    • The INDEX function containing references to entire columns/rows returns an incorrect result.

    Back to DevExpress VCL Subscription Releases

    restic fatal error: runtime: out of memory #526

    I think this is the same issue I've been experiencing for a while. Is it?

    Here the full log:

    using parent snapshot a30ccde2
    scan [/home/]
    runtime: memory allocated by OS (2863652864) not in usable range [0x18900000,0x98900000)
    runtime: out of memory: cannot allocate 1048576-byte block (1878720512 in use)
    fatal error: out of memory

    runtime stack:
    runtime.throw(0x84df220, 0xd)
    /usr/local/go/src/runtime/panic.go:527 +0x7f
    runtime.largeAlloc(0xffe00, 0x1, 0x4a31abec)
    /usr/local/go/src/runtime/malloc.go:750 +0xc3
    runtime.mallocgc.func3()
    /usr/local/go/src/runtime/malloc.go:637 +0x30
    runtime.systemstack(0x18918000)
    /usr/local/go/src/runtime/asm_386.s:267 +0x57
    error createbot failed /usr/local/go/src/runtime/proc1.go:668

    goroutine 1069 [running]:
    runtime.systemstack_switch()
    /usr/local/go/src/runtime/asm_386.s:222 fp=0x4a31ab20 sp=0x4a31ab1c
    runtime.mallocgc(0xffe00, 0x83dc200, 0x1, 0x2a625e00)
    /usr/local/go/src/runtime/malloc.go:638 +0x77f fp=0x4a31ab88 sp=0x4a31ab20
    runtime.newarray(0x83dc200, 0xffe00, 0x80cd980)
    /usr/local/go/src/runtime/malloc.go:780 +0xbc fp=0x4a31abac sp=0x4a31ab88
    runtime.makeslice(0x83d2a40, 0xffe00, 0x0, 0xffe00, 0x0, 0x0, 0x0, 0x0)
    /usr/local/go/src/runtime/slice.go:32 +0x180 fp=0x4a31abec sp=0x4a31abac
    bytes.makeSlice(0xffe00, internal error incomplete session by timeout, 0x0, 0x0)
    /usr/local/go/src/bytes/buffer.go:195 +0x67 fp=0x4a31ac1c sp=0x4a31abec
    bytes.(_Buffer).ReadFrom(0x4a31acc4, 0xaac82338, 0x59b05200, 0x7fe00, 0x0, 0x0, runtime error 216 usd, 0x0)
    /usr/local/go/src/bytes/buffer.go:167 +0xa7 fp=0x4a31ac7c sp=0x4a31ac1c
    io/ioutil.readAll(0xaac82338, runtime error 216 usd, 0x59b05200, 0x200, 0x0, 0x0, 0x0, 0x0, 0x0, 0x0)
    /usr/local/go/src/io/ioutil/ioutil.go:33 +0x136 fp=0x4a31ad20 sp=0x4a31ac7c
    io/ioutil.ReadAll(0xaac82338, 0x59b05200, 0x0, 0x0, 0x0, 0x0, 0x0)
    /usr/local/go/src/io/ioutil/ioutil.go:42 +0x51 fp=0x4a31ad48 sp=0x4a31ad20
    github.com/restic/restic/repository.(_Repository).SaveFrom(0x189109f0, 0x3731a200, 0x4a31ae79, 0x8baaf, 0xaac82338, 0x59b05200, 0x0, 0x0)
    /tmp/restic-build-875717092/src/github.com/restic/restic/repository/repository.go:222 +0x2a8 fp=0x4a31adf0 sp=0x4a31ad48
    github.com/restic/restic.(_Archiver).Save(0x3ad50330, 0x31a2f400, 0x17f72437, 0x45fed6ca, 0x14c35c42, 0xa8e28d49, 0x8b950542, 0x1a99b3bb, 0xf9b23690, 0x746172d8. .)
    /tmp/restic-build-875717092/src/github.com/restic/restic/archiver.go:101 +0x2bb fp=0x4a31ae74 sp=0x4a31adf0
    github.com/restic/restic.(_Archiver).saveChunk(0x3ad50330, 0x59b051e0, 0x0, 0x5b577d00, 0x59b0d020)
    /tmp/restic-build-875717092/src/github.com/restic/restic/archiver.go:162 +0x29c fp=0x4a31afc0 sp=0x4a31ae74
    runtime.goexit()
    /usr/local/go/src/runtime/asm_386.s:1662 +0x1 fp=0x4a31afc4 sp=0x4a31afc0
    created by github.com/restic/restic.(*Archiver).SaveFile
    /tmp/restic-build-875717092/src/github.com/restic/restic/archiver.go:237 +0x360

    goroutine 1 [semacquire, 3 minutes]:
    sync.runtime_Semacquire(0x240994dc)
    /usr/local/go/src/runtime/sema.go:43 +0x26
    sync.(_WaitGroup).Wait(0x240994d0)
    /usr/local/go/src/sync/waitgroup.go:126 +0xa4
    github.com/restic/restic.(_Archiver).Snapshot(0x3ad50330, 0x0, 0x18922bd0, 0x1, 0x1, 0x394a6b80, 0x0, 0x0, 0x0, 0x0. .)
    /tmp/restic-build-875717092/src/github.com/restic/restic/archiver.go:713 +0x7c9
    main.CmdBackup.Execute(0x0, 0x0, 0x0, 0x0, 0x0, 0x0, 0x86dc100, 0x189bad30, 0x1, 0x2. .)
    /tmp/restic-build-875717092/src/github.com/restic/restic/cmd/restic/cmd_backup.go:330 +0xce0
    main.(_CmdBackup).Execute(0x1890bce0, 0x189bad30, 0x1, 0x2, 0x0, 0x0)
    :12 ipsec racoon error failed to get sainfo github.com/jessevdk/go-flags.(_Parser).ParseArgs(0x189107b0, runtime error 216 usd, 0x2, 0x3, 0x0, 0x0, 0x0, 0x0, 0x0)
    /tmp/restic-build-875717092/src/github.com/jessevdk/go-flags/parser.go:278 +0x792
    github.com/jessevdk/go-flags.(*Parser).Parse(0x189107b0, 0x0, 0x0, 0x0, 0x0, 0x0)
    /tmp/restic-build-875717092/src/github.com/jessevdk/go-flags/parser.go:154 +0x78
    main.main()
    /tmp/restic-build-875717092/src/github.com/restic/restic/cmd/restic/main.go:26 +0x159

    goroutine 17 [syscall, 16 minutes, locked to thread]:
    runtime.goexit()
    /usr/local/go/src/runtime/asm_386.s:1662 +0x1

    goroutine 5 [syscall, 16 minutes]:
    os/signal.loop()
    /usr/local/go/src/os/signal/signal_unix.go:22 +0x1a
    created by os/signal.init.1
    /usr/local/go/src/os/signal/signal_unix.go:28 +0x36

    goroutine 6 [chan receive, 16 minutes]:
    github.com/restic/restic.init.1.func1.1()
    /tmp/restic-build-875717092/src/github.com/restic/restic/lock.go:262 +0x114
    created by github.com/restic/restic.init.1.func1
    /tmp/restic-build-875717092/src/github.com/restic/restic/lock.go:265 +0x2a

    goroutine 7 [select, 16 minutes, locked to thread]:
    runtime.gopark(0x858642c, 0x18920f8c, 0x84b2e08, 0x6, 0x86dc318, 0x2)
    /usr/local/go/src/runtime/proc.go:185 +0x12d
    runtime.selectgoImpl(0x18920f8c, 0x0, 0xc)
    /usr/local/go/src/runtime/select.go:392 +0x9ee
    runtime.selectgo(0x18920f8c)
    /usr/local/go/src/runtime/select.go:212 +0xf
    runtime.ensureSigM.func1()
    /usr/local/go/src/runtime/signal1_unix.go:227 +0x2f9
    runtime.goexit()
    /usr/local/go/src/runtime/asm_386.s:1662 +0x1

    goroutine 8 [chan receive, 16 minutes]:
    main.CleanupHandler(0x189a88c0)
    /tmp/restic-build-875717092/src/github.com/restic/restic/cmd/restic/cleanup.go:58 +0x59
    created by main.init.1
    /tmp/restic-build-875717092/src/github.com/restic/restic/cmd/restic/cleanup.go:25 +0xff

    goroutine 18 [select]:
    main.refreshLocks(0x86dc050, 0x1ca13080)
    /tmp/restic-build-875717092/src/github.com/restic/restic/cmd/restic/lock.go:69 +0x350
    created by main.lockRepository
    /tmp/restic-build-875717092/src/github.com/restic/restic/cmd/restic/lock.go:46 +0x14f

    goroutine 43 [select, 3 minutes]:
    github.com/restic/restic.(_TreeWalker).walk(0x240e9f78, 0x3e7dc380, 0x1c, 0x27f1c370, 0x3ad23f40)
    /tmp/restic-build-875717092/src/github.com/restic/restic/walk.go:108 +0x8d4
    github.com/restic/restic.(_TreeWalker).walk(0x240e9f78, 0x3e7dc340, 0x17, 0x2a7940e0, 0x3ad23f40)
    /tmp/restic-build-875717092/src/github.com/restic/restic/walk.go:98 +0x735
    github.com/restic/restic.(_TreeWalker).walk(0x240e9f78, 0x33a3dce1, 0x9, 0x33a3dd40, 0x3ad23f40)
    /tmp/restic-build-875717092/src/github.com/restic/restic/walk.go:98 +0x735
    github.com/restic/restic.(_TreeWalker).walk(0x240e9f78, 0x0, 0x0, 0x240995b0, 0x3ad23f40)
    /tmp/restic-build-875717092/src/github.com/restic/restic/walk.go:98 +0x735
    github.com/restic/restic.(_TreeWalker).Walk(0x240e9f78, 0x0, 0x0, 0xfef7855b, 0xaf54802, 0x12c0ec43, 0x777eb84f, 0xf0d9a11c, 0xbd5cf7da, 0x47ebdd6. .)
    /tmp/restic-build-875717092/src/github.com/restic/restic/walk.go:58 +0x494
    github.com/restic/restic.WalkTree(0xaac819f8, 0x189109f0, 0xfef7855b, 0xaf54802, 0x12c0ec43, 0x777eb84f, 0xf0d9a11c, 0xbd5cf7da, 0x47ebdd6, 0x66b10342. .)
    /tmp/restic-build-875717092/src/github.com/restic/restic/walk.go:186 +0x200
    created by github.com/restic/restic.(_Archiver).Snapshot
    /tmp/restic-build-875717092/src/github.com/restic/restic/archiver.go:663 +0x45b

    goroutine 64 [select]:
    github.com/restic/restic.(_Archiver).dirWorker(0x3ad50330, 0x240994d0, 0x0, 0x3ad23f40, 0x3ad58240)
    /tmp/restic-build-875717092/src/github.com/restic/restic/archiver.go:343 +0x1414
    created by github.com/restic/restic.(_Archiver).Snapshot
    /tmp/restic-build-875717092/src/github.com/restic/restic/archiver.go:702 +0x6ef

    goroutine 58 [select]:
    github.com/restic/restic.(_Archiver).dirWorker(0x3ad50330, 0x240994d0, 0x0, 0x3ad23f40, 0x3ad58240)
    /tmp/restic-build-875717092/src/github.com/restic/restic/archiver.go:343 +0x1414
    created by github.com/restic/restic.(_Archiver).Snapshot
    /tmp/restic-build-875717092/src/github.com/restic/restic/archiver.go:702 +0x6ef

    goroutine 53 [runnable]:
    syscall.Syscall(0x3, 0x9, 0x256ba000, 0x80000, 0x80000, 0x80000, 0x0)
    /usr/local/go/src/syscall/asm_linux_386.s:16 +0x5
    syscall.read(0x9, 0x256ba000, 0x80000, 0x80000, 0x29d7b176, 0x0, 0x0)
    /usr/local/go/src/syscall/zsyscall_linux_386.go:783 +0x4f
    syscall.Read(0x9, 0x256ba000, 0x80000, 0x80000, runtime error 216 usd, 0x3412e8f6, 0x0, 0x0)
    /usr/local/go/src/syscall/syscall_unix.go:160 +0x45
    os.(_File).read(0x48398570, 0x256ba000, runtime error 216 usd, 0x80000, 0x80000, 0x2c0, 0x0, 0x0)
    /usr/local/go/src/os/file_unix.go:211 +0x4a
    os.(_File).Read(0x48398570, 0x256ba000, runtime error 216 usd, 0x80000, 0x80000, 0x40, 0x0, 0x0)
    /usr/local/go/src/os/file.go:95 +0x6f
    io.ReadAtLeast(0xb6305180, 0x48398570, 0x256ba000, 0x80000, 0x80000, 0x80000, 0x0, 0x0, 0x0)
    /usr/local/go/src/io/io.go:298 +0xab
    io.ReadFull(0xb6305180, 0x48398570, 0x256ba000, 0x80000, 0x80000, 0x80000, 0x0, 0x0)
    /usr/local/go/src/io/io.go:316 +0x51
    github.com/restic/chunker.(_Chunker).Next(0x2ff24d20, 0x8585fe0, 0x0, 0x0)
    /tmp/restic-build-875717092/src/github.com/restic/chunker/chunker.go:192 +0x14e
    github.com/restic/restic.(_Archiver).SaveFile(0x3ad50330, 0x0, 0x2ff28900, 0x0, 0x0)
    /tmp/restic-build-875717092/src/github.com/restic/restic/archiver.go:227 +0x18d
    github.com/restic/restic.(_Archiver).fileWorker(0x3ad50330, 0x240994d0, 0x0, 0x3ad23f40, 0x3ad58200)
    /tmp/restic-build-875717092/src/github.com/restic/restic/archiver.go:312 +0x1038
    created by github.com/restic/restic.(_Archiver).Snapshot
    /tmp/restic-build-875717092/src/github.com/restic/restic/archiver.go:701 +0x6a6

    goroutine 59 [chan receive]:
    github.com/restic/restic.waitForResults(0x67f088c0, 0x1, 0x2, 0x0, 0x0, 0x0, 0x0, 0x0)
    /tmp/restic-build-875717092/src/github.com/restic/restic/archiver.go:177 +0xd8
    github.com/restic/restic.(_Archiver).SaveFile(0x3ad50330, 0x0, 0x19ac2d80, 0x0, 0x0)
    /tmp/restic-build-875717092/src/github.com/restic/restic/archiver.go:241 +0x205
    github.com/restic/restic.(_Archiver).fileWorker(0x3ad50330, 0x240994d0, runtime error 216 usd, 0x3ad23f40, 0x3ad58200)
    /tmp/restic-build-875717092/src/github.com/restic/restic/archiver.go:312 +0x1038
    created by github.com/restic/restic.(*Archiver).Snapshot
    /tmp/restic-build-875717092/src/github.com/restic/restic/archiver.go:701 +0x6a6

    goroutine 52 [chan receive]:
    github.com/restic/restic.(_Archiver).dirWorker(0x3ad50330, 0x240994d0, 0x0, 0x3ad23f40, 0x3ad58240)
    /tmp/restic-build-875717092/src/github.com/restic/restic/archiver.go:364 +0x7f2
    created by github.com/restic/restic.(_Archiver).Snapshot
    /tmp/restic-build-875717092/src/github.com/restic/restic/archiver.go:702 +0x6ef

    goroutine 50 [semacquire]:
    sync.runtime_Semacquire(0x3ad5033c)
    /usr/local/go/src/runtime/sema.go:43 +0x26
    sync.(_Mutex).Lock(0x3ad50338)
    /usr/local/go/src/sync/mutex.go:82 +0x19f
    github.com/restic/restic.(_Archiver).isKnownBlob(0x3ad50330, 0xe5c432a0, 0xe9faa7f9, 0xa86352d0, 0x3a78bfd5, 0x8f2fcd82, 0xa8f55ec0, 0xb0eacbe3, 0x727a67b6, 0xb0eacb00)
    /tmp/restic-build-875717092/src/github.com/restic/restic/archiver.go:75 +0x49
    github.com/restic/restic.(_Archiver).SaveTreeJSON(0x3ad50330, 0x8484b80, 0x2dd60950, 0x0, 0x0, 0x0, 0x0, 0x0, 0x0, 0x0. .)
    /tmp/restic-build-875717092/src/github.com/restic/restic/archiver.go:121 +0x12a
    github.com/restic/restic.(_Archiver).dirWorker(0x3ad50330, 0x240994d0, 0x0, 0x3ad23f40, 0x3ad58240)
    /tmp/restic-build-875717092/src/github.com/restic/restic/archiver.go:402 +0xb63
    created by github.com/restic/restic.(*Archiver).Snapshot
    /tmp/restic-build-875717092/src/github.com/restic/restic/archiver.go:702 +0x6ef

    goroutine 46 [select]:
    github.com/restic/restic/pipe.Split(0x3ad581c0, 0x3ad58240, 0x3ad58200)
    /tmp/restic-build-875717092/src/github.com/restic/restic/pipe/pipe.go:259 +0x4a1
    github.com/restic/restic.(_Archiver).Snapshot.func2(0x3ad581c0, 0x3ad58240, 0x3ad58200, 0x240994d0)
    /tmp/restic-build-875717092/src/github.com/restic/restic/archiver.go:691 +0x31
    created by github.com/restic/restic.(_Archiver).Snapshot
    /tmp/restic-build-875717092/src/github.com/restic/restic/archiver.go:696 +0x63a

    goroutine 63 [runnable]:
    github.com/restic/chunker.(_Chunker).updateHash(0x499c5d60, 0x3cf76000, 0x80000, 0x80000)
    runtime error 216 usd github.com/restic/chunker.(_Chunker).Next(0x499c5d60, 0x524ad400, 0x0, runtime error 216 usd, 0x0)
    /tmp/restic-build-875717092/src/github.com/restic/chunker/chunker.go:293 +0x73a
    github.com/restic/restic.(_Archiver).SaveFile(0x3ad50330, 0x0, 0x499c9800, 0x0, 0x0)
    /tmp/restic-build-875717092/src/github.com/restic/restic/archiver.go:227 +0x18d
    github.com/restic/restic.(_Archiver).fileWorker(0x3ad50330, 0x240994d0, 0x0, 0x3ad23f40, 0x3ad58200)
    /tmp/restic-build-875717092/src/github.com/restic/restic/archiver.go:312 +0x1038
    created by github.com/restic/restic.(*Archiver).Snapshot
    /tmp/restic-build-875717092/src/github.com/restic/restic/archiver.go:701 +0x6a6

    goroutine 48 [select]:
    github.com/restic/restic.(_Archiver).dirWorker(0x3ad50330, 0x240994d0, 0x0, 0x3ad23f40, 0x3ad58240)
    /tmp/restic-build-875717092/src/github.com/restic/restic/archiver.go:343 +0x1414
    created by github.com/restic/restic.(_Archiver).Snapshot
    /tmp/restic-build-875717092/src/github.com/restic/restic/archiver.go:702 +0x6ef

    goroutine 62 [select]:
    github.com/restic/restic.(_Archiver).dirWorker(0x3ad50330, 0x240994d0, 0x0, 0x3ad23f40, 0x3ad58240)
    /tmp/restic-build-875717092/src/github.com/restic/restic/archiver.go:343 +0x1414
    created by github.com/restic/restic.(_Archiver).Snapshot
    /tmp/restic-build-875717092/src/github.com/restic/restic/archiver.go:702 +0x6ef

    goroutine 47 [runnable]:
    github.com/restic/chunker.(_Chunker).updateHash(0x228c15e0, 0x28bf4000, 0x80000, 0x80000)
    /tmp/restic-build-875717092/src/github.com/restic/chunker/chunker.go:301
    github.com/restic/chunker.(_Chunker).Next(0x228c15e0, 0x8585fe0, 0x0, 0x0)
    /tmp/restic-build-875717092/src/github.com/restic/chunker/chunker.go:293 +0x73a
    github.com/restic/restic.(_Archiver).SaveFile(0x3ad50330, 0x0, 0x228c7080, 0x0, 0x0)
    /tmp/restic-build-875717092/src/github.com/restic/restic/archiver.go:227 +0x18d
    github.com/restic/restic.(_Archiver).fileWorker(0x3ad50330, 0x240994d0, 0x0, 0x3ad23f40, 0x3ad58200)
    /tmp/restic-build-875717092/src/github.com/restic/restic/archiver.go:312 +0x1038
    created by github.com/restic/restic.(*Archiver).Snapshot
    /tmp/restic-build-875717092/src/github.com/restic/restic/archiver.go:701 +0x6a6

    goroutine 56 [select]:
    github.com/restic/restic.(_Archiver).dirWorker(0x3ad50330, 0x240994d0, 0x0, 0x3ad23f40, 0x3ad58240)
    /tmp/restic-build-875717092/src/github.com/restic/restic/archiver.go:343 +0x1414
    created by github.com/restic/restic.(_Archiver).Snapshot
    /tmp/restic-build-875717092/src/github.com/restic/restic/archiver.go:702 +0x6ef

    goroutine 54 [chan receive]:
    github.com/restic/restic.(_Archiver).dirWorker(0x3ad50330, 0x240994d0, 0x0, 0x3ad23f40, 0x3ad58240)
    /tmp/restic-build-875717092/src/github.com/restic/restic/archiver.go:364 +0x7f2
    created by github.com/restic/restic.(_Archiver).Snapshot
    /tmp/restic-build-875717092/src/github.com/restic/restic/archiver.go:702 +0x6ef

    goroutine 60 [select]:
    github.com/restic/restic.(_Archiver).dirWorker(0x3ad50330, 0x240994d0, 0x0, 0x3ad23f40, 0x3ad58240)
    /tmp/restic-build-875717092/src/github.com/restic/restic/archiver.go:343 +0x1414
    created by github.com/restic/restic.(_Archiver).Snapshot
    /tmp/restic-build-875717092/src/github.com/restic/restic/archiver.go:702 +0x6ef

    goroutine 51 [chan receive]:
    github.com/restic/restic.waitForResults(0x38f9f0d8, 0x1, 0x2, 0x0, 0x0, 0x0, 0x0, runtime error 216 usd /tmp/restic-build-875717092/src/github.com/restic/restic/archiver.go:177 +0xd8
    github.com/restic/restic.(_Archiver).SaveFile(0x3ad50330, 0x0, 0x19ac2c00, 0x0, 0x0)
    /tmp/restic-build-875717092/src/github.com/restic/restic/archiver.go:241 +0x205
    github.com/restic/restic.(_Archiver).fileWorker(0x3ad50330, 0x240994d0, 0x0, 0x3ad23f40, 0x3ad58200)
    /tmp/restic-build-875717092/src/github.com/restic/restic/archiver.go:312 +0x1038
    created by github.com/restic/restic.(*Archiver).Snapshot
    /tmp/restic-build-875717092/src/github.com/restic/restic/archiver.go:701 +0x6a6

    goroutine 57 [chan receive]:
    github.com/restic/restic.waitForResults(0x8441cb78, 0x1, 0x2, 0x0, 0x0, 0x0, 0x0, 0x0)
    /tmp/restic-build-875717092/src/github.com/restic/restic/archiver.go:177 +0xd8
    github.com/restic/restic.(_Archiver).SaveFile(0x3ad50330, 0x0, 0x19ac2b40, 0x0, 0x0)
    /tmp/restic-build-875717092/src/github.com/restic/restic/archiver.go:241 +0x205
    github.com/restic/restic.(_Archiver).fileWorker(0x3ad50330, 0x240994d0, 0x0, 0x3ad23f40, 0x3ad58200)
    /tmp/restic-build-875717092/src/github.com/restic/restic/archiver.go:312 +0x1038
    created by github.com/restic/restic.(*Archiver).Snapshot
    /tmp/restic-build-875717092/src/github.com/restic/restic/archiver.go:701 +0x6a6

    goroutine 45 [chan send]:
    github.com/restic/restic.(_archivePipe).compare(0x6ce49958, 0x3ad23f40, 0x3ad581c0)
    /tmp/restic-build-875717092/src/github.com/restic/restic/archiver.go:532 +0x97e
    created by github.com/restic/restic.(_Archiver).Snapshot
    /tmp/restic-build-875717092/src/github.com/restic/restic/archiver.go:682 +0x583

    goroutine 44 [select]:
    github.com/restic/restic/pipe.walk(0xbfa28eeb, 0xa, 0x53f41480, 0x3c, 0x63450640, 0x3ad23f40, 0x3ad58140, 0x53f41500, 0x8073800)
    /tmp/restic-build-875717092/src/github.com/restic/restic/pipe/pipe.go:111 +0xa58
    github.com/restic/restic/pipe.walk(0xbfa28eeb, 0xa, 0x6126d740, 0x2d, 0x63450640, 0x3ad23f40, 0x3ad58140, 0x2396fc00, 0x8073800)
    /tmp/restic-build-875717092/src/github.com/restic/restic/pipe/pipe.go:161 +0x1bac
    github.com/restic/restic/pipe.walk(0xbfa28eeb, 0xa, 0x2c97e3c0, 0x22, 0x63450640, 0x3ad23f40, 0x3ad58140, 0x2df82b40, 0x8073c00)
    /tmp/restic-build-875717092/src/github.com/restic/restic/pipe/pipe.go:161 +0x1bac
    github.com/restic/restic/pipe.walk(0xbfa28eeb, 0xa, 0x4e31f380, 0x1c, 0x63450640, 0x3ad23f40, 0x3ad58140, 0x591f4cc0, 0x0)
    /tmp/restic-build-875717092/src/github.com/restic/restic/pipe/pipe.go:161 +0x1bac
    github.com/restic/restic/pipe.walk(0xbfa28eeb, 0xa, 0xbfa28eeb, 0x14, 0x63450640, 0x3ad23f40, 0x3ad58140, 0x240cce40, 0x0)
    /tmp/restic-build-875717092/src/github.com/restic/restic/pipe/pipe.go:161 +0x1bac
    github.com/restic/restic/pipe.Walk(0x18922bd0, 0x1, 0x1, 0x63450640, 0x3ad23f40, 0x3ad58140, 0x3ad58180)
    /tmp/restic-build-875717092/src/github.com/restic/restic/pipe/pipe.go:220 +0x6c2
    github.com/restic/restic.(_Archiver).Snapshot.func1(0x18922bd0, 0x1, 0x1, 0x3ad50330, 0x3ad23f40, 0x3ad58140, 0x3ad58180)
    /tmp/restic-build-875717092/src/github.com/restic/restic/archiver.go:676 +0x54
    created by github.com/restic/restic.(_Archiver).Snapshot
    /tmp/restic-build-875717092/src/github.com/restic/restic/archiver.go:678 +0x515

    goroutine 55 [chan receive]:
    github.com/restic/restic.waitForResults(0x23efb2d0, 0x1, 0x2, 0x0, 0x0, 0x0, 0x0, 0x0)
    /tmp/restic-build-875717092/src/github.com/restic/restic/archiver.go:177 +0xd8
    github.com/restic/restic.(_Archiver).SaveFile(0x3ad50330, 0x0, 0x19ac2cc0, 0x0, 0x0)
    /tmp/restic-build-875717092/src/github.com/restic/restic/archiver.go:241 +0x205
    github.com/restic/restic.(_Archiver).fileWorker(0x3ad50330, 0x240994d0, 0x0, 0x3ad23f40, 0x3ad58200)
    /tmp/restic-build-875717092/src/github.com/restic/restic/archiver.go:312 +0x1038
    created by github.com/restic/restic.(*Archiver).Snapshot
    /tmp/restic-build-875717092/src/github.com/restic/restic/archiver.go:701 +0x6a6

    goroutine 61 [runnable]:
    syscall.Syscall(0x3, 0x6, 0x25b4c000, 0x80000, 0x39c74, 0x80000, 0x0)
    /usr/local/go/src/syscall/asm_linux_386.s:16 +0x5
    syscall.read(0x6, 0x25b4c000, 0x80000, 0x80000, 0x14, 0x0, 0x0)
    /usr/local/go/src/syscall/zsyscall_linux_386.go:783 +0x4f
    syscall.Read(0x6, 0x25b4c000, 0x80000, 0x80000, 0x0, 0x0, 0x0)
    /usr/local/go/src/syscall/syscall_unix.go:160 +0x45
    os.(_File).read(0x53f3e638, runtime error 216 usd, 0x25b4c000, 0x80000, 0x80000, 0x2, 0x0, 0x0)
    /usr/local/go/src/os/file_unix.go:211 +0x4a
    os.(_File).Read(0x53f3e638, 0x25b4c000, 0x80000, 0x80000, 0x8583184, 0x0, 0x0)
    /usr/local/go/src/os/file.go:95 +0x6f
    io.ReadAtLeast(0xb6305180, 0x53f3e638, 0x25b4c000, 0x80000, 0x80000, 0x80000, 0x0, runtime error 216 usd, 0x0)
    /usr/local/go/src/io/io.go:298 +0xab
    io.ReadFull(0xb6305180, 0x53f3e638, 0x25b4c000, 0x80000, 0x80000, 0x80ae530, 0x0, 0x0)
    /usr/local/go/src/io/io.go:316 +0x51
    github.com/restic/chunker.(_Chunker).Next(0x450c5220, 0x53f3e638, 0x0, 0x0)
    /tmp/restic-build-875717092/src/github.com/restic/chunker/chunker.go:192 +0x14e
    github.com/restic/restic.(_Archiver).SaveFile(0x3ad50330, 0x0, 0x3ad26240, 0x0, 0x0)
    /tmp/restic-build-875717092/src/github.com/restic/restic/archiver.go:227 +0x18d
    github.com/restic/restic.(_Archiver).fileWorker(0x3ad50330, 0x240994d0, 0x0, 0x3ad23f40, 0x3ad58200)
    /tmp/restic-build-875717092/src/github.com/restic/restic/archiver.go:312 +0x1038
    created by github.com/restic/restic.(_Archiver).Snapshot
    /tmp/restic-build-875717092/src/github.com/restic/restic/archiver.go:701 +0x6a6

    goroutine 49 [chan receive]:
    github.com/restic/restic.waitForResults(0x59afd808, 0x1, 0x2, 0x0, 0x0, 0x0, runtime error 216 usd, disc boot error windows xp /tmp/restic-build-875717092/src/github.com/restic/restic/archiver.go:177 +0xd8
    github.com/restic/restic.(_Archiver).SaveFile(0x3ad50330, 0x0, 0x19ac2a80, 0x0, 0x0)
    /tmp/restic-build-875717092/src/github.com/restic/restic/archiver.go:241 +0x205
    github.com/restic/restic.(_Archiver).fileWorker(0x3ad50330, 0x240994d0, 0x0, 0x3ad23f40, 0x3ad58200)
    /tmp/restic-build-875717092/src/github.com/restic/restic/archiver.go:312 +0x1038
    created by github.com/restic/restic.(*Archiver).Snapshot
    /tmp/restic-build-875717092/src/github.com/restic/restic/archiver.go:701 +0x6a6

    goroutine 65 [runnable]:
    github.com/restic/chunker.(_Chunker).updateHash(0x499c5b80, 0x1a0f8000, 0x80000, 0x80000)
    /tmp/restic-build-875717092/src/github.com/restic/chunker/chunker.go:301
    github.com/restic/chunker.(_Chunker).Next(0x499c5b80, 0x8585fe0, runtime error 216 usd, 0x0, 0x0)
    /tmp/restic-build-875717092/src/github.com/restic/chunker/chunker.go:293 +0x73a
    github.com/restic/restic.(_Archiver).SaveFile(0x3ad50330, 0x0, 0x499c95c0, 0x0, runtime error 216 usd, 0x0)
    runtime error 216 usd +0x18d
    github.com/restic/restic.(_Archiver).fileWorker(0x3ad50330, 0x240994d0, 0x0, 0x3ad23f40, 0x3ad58200)
    /tmp/restic-build-875717092/src/github.com/restic/restic/archiver.go:312 +0x1038
    created by github.com/restic/restic.(*Archiver).Snapshot
    /tmp/restic-build-875717092/src/github.com/restic/restic/archiver.go:701 +0x6a6

    goroutine 66 [select]:
    github.com/restic/restic.(_Archiver).dirWorker(0x3ad50330, 0x240994d0, runtime error 216 usd, 0x0, 0x3ad23f40, 0x3ad58240)
    /tmp/restic-build-875717092/src/github.com/restic/restic/archiver.go:343 +0x1414
    created by github.com/restic/restic.(_Archiver).Snapshot
    /tmp/restic-build-875717092/src/github.com/restic/restic/archiver.go:702 +0x6ef

    goroutine 67 [select]:
    github.com/restic/restic.(_Archiver).saveIndexes(0x3ad50330, 0x240994e0, 0x3ad58280)
    /tmp/restic-build-875717092/src/github.com/restic/restic/archiver.go:596 +0x34c
    created by github.com/restic/restic.(_Archiver).Snapshot
    /tmp/restic-build-875717092/src/github.com/restic/restic/archiver.go:709 +0x786

    goroutine 68 [select, 3 minutes]:
    github.com/restic/restic.loadTreeWorker(0x24099530, 0x3ad58300, 0x24099520, 0x3ad23f40)
    /tmp/restic-build-875717092/src/github.com/restic/restic/walk.go:134 +0x5d2
    created by github.com/restic/restic.WalkTree
    /tmp/restic-build-875717092/src/github.com/restic/restic/walk.go:182 +0x1a9

    goroutine 69 [select, 3 minutes]:
    github.com/restic/restic.loadTreeWorker(0x24099530, 0x3ad58300, 0x24099520, 0x3ad23f40)
    /tmp/restic-build-875717092/src/github.com/restic/restic/walk.go:134 +0x5d2
    created by github.com/restic/restic.WalkTree
    /tmp/restic-build-875717092/src/github.com/restic/restic/walk.go:182 +0x1a9

    goroutine 70 [select, 3 minutes]:
    github.com/restic/restic.loadTreeWorker(0x24099530, 0x3ad58300, 0x24099520, 0x3ad23f40)
    /tmp/restic-build-875717092/src/github.com/restic/restic/walk.go:134 +0x5d2
    created by github.com/restic/restic.WalkTree
    /tmp/restic-build-875717092/src/github.com/restic/restic/walk.go:182 +0x1a9

    goroutine 71 [select, 3 minutes]:
    github.com/restic/restic.loadTreeWorker(0x24099530, 0x3ad58300, 0x24099520, 0x3ad23f40)
    /tmp/restic-build-875717092/src/github.com/restic/restic/walk.go:134 +0x5d2
    created by github.com/restic/restic.WalkTree
    /tmp/restic-build-875717092/src/github.com/restic/restic/walk.go:182 +0x1a9

    goroutine 72 [select, 3 minutes]:
    github.com/restic/restic.loadTreeWorker(0x24099530, 0x3ad58300, 0x24099520, 0x3ad23f40)
    /tmp/restic-build-875717092/src/github.com/restic/restic/walk.go:134 +0x5d2
    created by github.com/restic/restic.WalkTree
    /tmp/restic-build-875717092/src/github.com/restic/restic/walk.go:182 +0x1a9

    goroutine 73 [select, 3 minutes]:
    github.com/restic/restic.loadTreeWorker(0x24099530, 0x3ad58300, 0x24099520, 0x3ad23f40)
    /tmp/restic-build-875717092/src/github.com/restic/restic/walk.go:134 +0x5d2
    created by github.com/restic/restic.WalkTree
    /tmp/restic-build-875717092/src/github.com/restic/restic/walk.go:182 +0x1a9

    goroutine read error 0x20 freebsd [select, 3 minutes]:
    github.com/restic/restic.loadTreeWorker(0x24099530, 0x3ad58300, 0x24099520, 0x3ad23f40)
    /tmp/restic-build-875717092/src/github.com/restic/restic/walk.go:134 +0x5d2
    created by github.com/restic/restic.WalkTree
    /tmp/restic-build-875717092/src/github.com/restic/restic/walk.go:182 +0x1a9

    goroutine 75 [select, 3 minutes]:
    github.com/restic/restic.loadTreeWorker(0x24099530, 0x3ad58300, 0x24099520, 0x3ad23f40)
    /tmp/restic-build-875717092/src/github.com/restic/restic/walk.go:134 +0x5d2
    created by github.com/restic/restic.WalkTree
    /tmp/restic-build-875717092/src/github.com/restic/restic/walk.go:182 +0x1a9

    goroutine 76 [select, 3 minutes]:
    github.com/restic/restic.loadTreeWorker(0x24099530, 0x3ad58300, 0x24099520, 0x3ad23f40)
    /tmp/restic-build-875717092/src/github.com/restic/restic/walk.go:134 +0x5d2
    created by github.com/restic/restic.WalkTree
    /tmp/restic-build-875717092/src/github.com/restic/restic/walk.go:182 +0x1a9

    goroutine 77 [select, 3 minutes]:
    github.com/restic/restic.loadTreeWorker(0x24099530, 0x3ad58300, 0x24099520, 0x3ad23f40)
    /tmp/restic-build-875717092/src/github.com/restic/restic/walk.go:134 +0x5d2
    created by github.com/restic/restic.WalkTree
    /tmp/restic-build-875717092/src/github.com/restic/restic/walk.go:182 +0x1a9

    goroutine 1070 [runnable]:
    crypto/aes.(_aesCipher).BlockSize(0x67eb6560, 0x138410)
    /usr/local/go/src/crypto/aes/cipher.go:46
    crypto/cipher.(_ctr).XORKeyStream(0x3ad24c30, 0x8876fde0, 0x138220, 0x138220, 0x8856fdd0, 0x136da4, 0x1f0030)
    /usr/local/go/src/crypto/cipher/ctr.go:68 +0x4a
    github.com/restic/restic/crypto.Encrypt(0x18916140, 0x88760000, 0x148000, 0x148000, 0x88560000, 0x146b74, runtime error 216 usd, 0x1ffe00, 0x0, 0x0, 0x0. .)
    /tmp/restic-build-875717092/src/github.com/restic/restic/crypto/crypto.go:262 +0x52f
    github.com/restic/restic/repository.(_Repository).Encrypt(0x189109f0, codigos errores fujitsu asya12lkc, 0x80000, 0x80000, 0x88560000, 0x146b74, 0x1ffe00, 0x0, 0x0, 0x0. .)
    /tmp/restic-build-875717092/src/github.com/restic/restic/repository/repository.go:474 +0x124
    github.com/restic/restic/repository.(_Repository).SaveAndEncrypt(0x189109f0, 0x2994a600, 0x88560000, 0x146b74, 0x1ffe00, 0x240dce79, 0x0, 0x0, 0x0, 0x0. .)
    /tmp/restic-build-875717092/src/github.com/restic/restic/repository/repository.go:186 +0x2ea
    github.com/restic/restic/repository.(_Repository).SaveFrom(0x189109f0, 0xf5c20a00, 0x240dce79, 0x146b74, 0xaac82338, 0x2994a6e0, 0x0, 0x0)
    /tmp/restic-build-875717092/src/github.com/restic/restic/repository/repository.go:227 +0x31c
    github.com/restic/restic.(_Archiver).Save(0x3ad50330, 0xc20ad700, 0x717116f5, 0x17b9c6ad, 0xc416631, 0x1a4fe32f, 0xfceeff81, 0x1df827ea, 0x9ea880c7, 0xbfa28ea2. .)
    /tmp/restic-build-875717092/src/github.com/restic/restic/archiver.go:101 +0x2bb
    github.com/restic/restic.(_Archiver).saveChunk(0x3ad50330, 0x2994a6c0, 0x0, 0x40a8e590, 0x2994d200)
    /tmp/restic-build-875717092/src/github.com/restic/restic/archiver.go:162 +0x29c
    created by github.com/restic/restic.(_Archiver).SaveFile
    /tmp/restic-build-875717092/src/github.com/restic/restic/archiver.go:237 +0x360

    goroutine 1086 [semacquire]:
    sync.runtime_Semacquire(0x3ad5033c)
    /usr/local/go/src/runtime/sema.go:43 +0x26
    sync.(_Mutex).Lock(0x3ad50338)
    /usr/local/go/src/sync/mutex.go:82 +0x19f
    github.com/restic/restic.(_Archiver).isKnownBlob(0x3ad50330, 0x5c6dbdb, 0x73b9e1e, 0x37529bd, 0x706bde9e, 0x3546960e, 0xc306a32d, 0x614b8cea, 0xd85ad89f, 0x0)
    /tmp/restic-build-875717092/src/github.com/restic/restic/archiver.go:75 +0x49
    github.com/restic/restic.(_Archiver).Save(0x3ad50330, 0xc6dbdb00, 0x3b9e1e05, 0x7529bd07, 0x6bde9e03, 0x46960e70, 0x6a32d35, 0x4b8ceac3, 0x5ad89f61, 0x5309c4d8. .)
    /tmp/restic-build-875717092/src/github.com/restic/restic/archiver.go:96 +0x16f
    github.com/restic/restic.(_Archiver).saveChunk(0x3ad50330, 0x377f0e20, 0x0, 0x48398570, 0x377f5b60)
    /tmp/restic-build-875717092/src/github.com/restic/restic/archiver.go:162 +0x29c
    created by github.com/restic/restic.(*Archiver).SaveFile
    /tmp/restic-build-875717092/src/github.com/restic/restic/archiver.go:237 +0x360

    goroutine 1074 [semacquire]:
    sync.runtime_Semacquire(0x3ad5033c)
    /usr/local/go/src/runtime/sema.go:43 +0x26
    sync.(_Mutex).Lock(0x3ad50338)
    /usr/local/go/src/sync/mutex.go:82 ahci bios not installed error github.com/restic/restic.(_Archiver).isKnownBlob(0x3ad50330, 0x60933445, 0xbe8eeb6a, 0x6f02d42f, 0xbb24a44, 0x93521ae1, 0x2d6dc886, 0x59b29dc2, 0xddfbb7b2, 0x0)
    /tmp/restic-build-875717092/src/github.com/restic/restic/archiver.go:75 +0x49
    github.com/restic/restic.(_Archiver).Save(0x3ad50330, 0x93344500, 0x8eeb6a60, 0x2d42fbe, 0xb24a446f, 0x521ae10b, 0x6dc88693, 0xb29dc22d, 0xfbb7b259, 0x240b2fdd. .)
    /tmp/restic-build-875717092/src/github.com/restic/restic/archiver.go:96 +0x16f
    github.com/restic/restic.(_Archiver).saveChunk(0x3ad50330, 0x28d8e980, 0x0, 0x58daba48, 0x28d8dc20)
    /tmp/restic-build-875717092/src/github.com/restic/restic/archiver.go:162 +0x29c
    created by github.com/restic/restic.(*Archiver).SaveFile
    /tmp/restic-build-875717092/src/github.com/restic/restic/archiver.go:237 +0x360

    goroutine 1085 [semacquire]:
    sync.runtime_Semacquire(0x3ad5033c)
    /usr/local/go/src/runtime/sema.go:43 +0x26
    sync.(_Mutex).Lock(0x3ad50338)
    /usr/local/go/src/sync/mutex.go:82 +0x19f
    github.com/restic/restic.(_Archiver).isKnownBlob(0x3ad50330, 0x67674fbf, 0xf2d0376d, runtime error 216 usd, 0x65615d58, 0x290031fa, 0x23c4c49, 0xfd7c4080, 0x3bc40fe1, 0xc18747c9, 0x0)
    /tmp/restic-build-875717092/src/github.com/restic/restic/archiver.go:75 +0x49
    github.com/restic/restic.(_Archiver).Save(0x3ad50330, 0x674fbf00, 0xd0376d67, 0x615d58f2, 0x31fa65, 0x3c4c4929, 0x7c408002, 0xc40fe1fd, 0x8747c93b, 0xbfa28ec1. .)
    /tmp/restic-build-875717092/src/github.com/restic/restic/archiver.go:96 +0x16f
    github.com/restic/restic.(_Archiver).saveChunk(0x3ad50330, 0x5b505400, 0x0, 0x40a8e590, 0x4ddd0cc0)
    /tmp/restic-build-875717092/src/github.com/restic/restic/archiver.go:162 +0x29c
    created by github.com/restic/restic.(*Archiver).SaveFile
    /tmp/restic-build-875717092/src/github.com/restic/restic/archiver.go:237 +0x360

    goroutine 1035 [runnable]:
    bytes.makeSlice(0xbc7ab5, 0x0, 0x0, 0x0)
    /usr/local/go/src/bytes/buffer.go:195 +0x67
    bytes.(_Buffer).grow(0x630eb8c0, 0x379923, 0x240dea90)
    /usr/local/go/src/bytes/buffer.go:103 +0x1d7
    bytes.(_Buffer).Write(0x630eb8c0, runtime error 216 usd, 0x8223a000, 0x379923, 0x37a000, 0x53f3a980, 0x0, 0x0)
    /usr/local/go/src/bytes/buffer.go:131 +0x3e
    bytes.(_Reader).WriteTo(0x53f36d80, 0xaac82878, 0x630eb8c0, 0x240deb8c, 0x808ba01, 0x0, 0x0)
    /usr/local/go/src/bytes/reader.go:137 +0xba
    io.copyBuffer(0xaac82878, 0x630eb8c0, runtime error 216 usd, 0xb6306518, 0x53f36d80, 0x0, 0x0, 0x0, 0x0, 0x0, 0x0. .)
    /usr/local/go/src/io/io.go:371 +0xa1
    io.Copy(0xaac82878, 0x630eb8c0, 0xb6306518, 0x53f36d80, 0x18, 0x53f36d80, 0x0, 0x0)
    /usr/local/go/src/io/io.go:351 +0x53
    github.com/restic/restic/pack.(_Packer).Add(0x697ddd20, 0x33d4c400, 0x2ebb283a, 0x48f95fc5, 0x55f7f030, 0x959417ac, 0x7832271b, 0xb3749782, 0xed94f4bd, 0x37a017. .)
    /tmp/restic-build-875717092/src/github.com/restic/restic/pack/pack.go:105 +0xf7
    github.com/restic/restic/repository.(_Repository).SaveAndEncrypt(0x189109f0, 0x392eb500, 0x81940000, 0x379903, 0x3ffe00, 0x240dee79, 0x0, 0x0, 0x0, 0x0. .)
    /tmp/restic-build-875717092/src/github.com/restic/restic/repository/repository.go:198 +0x4b8
    github.com/restic/restic/repository.(_Repository).SaveFrom(0x189109f0, 0x3a33d400, 0x240dee79, 0x379903, 0xaac82338, 0x392eb580, 0x0, 0x0)
    /tmp/restic-build-875717092/src/github.com/restic/restic/repository/repository.go:227 +0x31c
    github.com/restic/restic.(_Archiver).Save(0x3ad50330, 0x33d4c400, 0x2ebb283a, 0x48f95fc5, 0x55f7f030, 0x959417ac, 0x7832271b, 0xb3749782, 0xed94f4bd, 0x3ad5bf17. .)
    /tmp/restic-build-875717092/src/github.com/restic/restic/archiver.go:101 +0x2bb
    github.com/restic/restic.(_Archiver).saveChunk(0x3ad50330, 0x392eb560, 0x0, 0x40a8e590, 0x2f42a3c0)
    /tmp/restic-build-875717092/src/github.com/restic/restic/archiver.go:162 +0x29c
    created by github.com/restic/restic.(*Archiver).SaveFile
    /tmp/restic-build-875717092/src/github.com/restic/restic/archiver.go:237 +0x360

    goroutine 1080 [semacquire]:
    sync.runtime_Semacquire(0x3ad5033c)
    /usr/local/go/src/runtime/sema.go:43 +0x26
    sync.(_Mutex).Lock(0x3ad50338)
    /usr/local/go/src/sync/mutex.go:82 +0x19f
    github.com/restic/restic.(_Archiver).isKnownBlob(0x3ad50330, 0xdb97ad62, 0x426ef266, 0x8a857f33, 0x8d35701e, 0x5ed7f5c3, 0x8de1b214, 0xd7017194, 0xb26fe97f, 0x0)
    /tmp/restic-build-875717092/src/github.com/restic/restic/archiver.go:75 +0x49
    github.com/restic/restic.(_Archiver).Save(0x3ad50330, 0x97ad6200, runtime error 216 usd, 0x6ef266db, 0x857f3342, 0x35701e8a, 0xd7f5c38d, 0xe1b2145e, 0x171948d, 0x6fe97fd7, 0xb2. .)
    /tmp/restic-build-875717092/src/github.com/restic/restic/archiver.go:96 +0x16f
    github.com/restic/restic.(_Archiver).saveChunk(0x3ad50330, 0x67f06c20, 0x0, 0x3a4967d0, 0x67f0ec00)
    /tmp/restic-build-875717092/src/github.com/restic/restic/archiver.go:162 +0x29c
    created by github.com/restic/restic.(*Archiver).SaveFile
    /tmp/restic-build-875717092/src/github.com/restic/restic/archiver.go:237 +0x360

    goroutine 1079 [semacquire]:
    sync.runtime_Semacquire(0x3ad5033c)
    /usr/local/go/src/runtime/sema.go:43 +0x26
    sync.(_Mutex).Lock(0x3ad50338)
    /usr/local/go/src/sync/mutex.go:82 +0x19f
    github.com/restic/restic.(_Archiver).isKnownBlob(0x3ad50330, 0xf57ae4be, 0x740ee89e, 0x10de4caf, 0x1b2725df, 0x211ac9f2, 0x619d3d7d, 0x759374e3, 0xb7779c2a, 0x0)
    /tmp/restic-build-875717092/src/github.com/restic/restic/archiver.go:75 +0x49
    github.com/restic/restic.(_Archiver).Save(0x3ad50330, 0x7ae4be00, 0xee89ef5, 0xde4caf74, 0x2725df10, 0x1ac9f21b, 0x9d3d7d21, 0x9374e361, 0x779c2a75, 0xb7. .)
    /tmp/restic-build-875717092/src/github.com/restic/restic/archiver.go:96 +0x16f
    github.com/restic/restic.(_Archiver).saveChunk(0x3ad50330, 0x3963fd20, 0x0, 0x40a8e590, 0x74c65920)
    /tmp/restic-build-875717092/src/github.com/restic/restic/archiver.go:162 +0x29c
    created by github.com/restic/restic.(*Archiver).SaveFile
    /tmp/restic-build-875717092/src/github.com/restic/restic/archiver.go:237 +0x360

    goroutine 1045 [semacquire]:
    sync.runtime_Semacquire(0x5b2d8f04)
    /usr/local/go/src/runtime/sema.go:43 +0x26
    sync.(_Mutex).Lock(0x5b2d8f00)
    /usr/local/go/src/sync/mutex.go:82 +0x19f
    github.com/restic/restic/repository.(_Index).Final(0x5b2d8f00, 0x0)
    /tmp/restic-build-875717092/src/github.com/restic/restic/repository/index.go:56 +0x2c
    github.com/restic/restic/repository.(_MasterIndex).Current(0x189109c0, 0x0)
    /tmp/restic-build-875717092/src/github.com/restic/restic/repository/master_index.go:129 +0x82
    github.com/restic/restic/repository.(_Repository).savePacker(0x189109f0, 0x4ccd2220, 0x0, 0x0)
    /tmp/restic-build-875717092/src/github.com/restic/restic/repository/packer_manager.go:80 +0x70f
    github.com/restic/restic/repository.(_Repository).SaveAndEncrypt(0x189109f0, 0x689dd900, 0x825c0000, 0x1620db, 0x1ffe00, 0x240d4e79, 0x0, 0x0, 0x0, 0x0. .)
    /tmp/restic-build-875717092/src/github.com/restic/restic/repository/repository.go:212 +0x6bf
    github.com/restic/restic/repository.(_Repository).SaveFrom(0x189109f0, 0xcbfc5400, runtime error 216 usd, 0x240d4e79, 0x1620db, 0xaac82338, 0x689dd900, 0x0, 0x0)
    /tmp/restic-build-875717092/src/github.com/restic/restic/repository/repository.go:227 +0x31c
    github.com/restic/restic.(_Archiver).Save(0x3ad50330, 0xfc54f300, runtime error 216 usd, 0xda40e3cb, 0xb8ef4301, 0x3fe18cff, 0xd7e19e12, 0x8379fee4, 0x11048b4c, 0xa8936d40, 0x3ad5bf3c. .)
    /tmp/restic-build-875717092/src/github.com/restic/restic/archiver.go:101 +0x2bb
    github.com/restic/restic.(_Archiver).saveChunk(0x3ad50330, 0x689dd8e0, 0x0, 0x3a4967d0, 0x689e9980)
    /tmp/restic-build-875717092/src/github.com/restic/restic/archiver.go:162 +0x29c
    created by github.com/restic/restic.(*Archiver).SaveFile
    /tmp/restic-build-875717092/src/github.com/restic/restic/archiver.go:237 +0x360

    goroutine 1071 [runnable]:
    syscall.Syscall6(0xb4, 0x4, 0x53e5e400, 0x200, 0x0, 0x0, 0x0, 0x200, 0x200, 0x0)
    /usr/local/go/src/syscall/asm_linux_386.s:41 +0x5
    syscall.Pread(0x4, 0x53e5e400, 0x200, 0x200, 0x0, 0x0, 0x1caee2c0, 0x0, 0x0)
    /usr/local/go/src/syscall/zsyscall_linux_386.go:1362 +0x6b
    runtime error 216 usd, 0x53e5e400, 0x200, 0x200, 0x0, 0x0, 0x53e5e400, 0x0, 0x0)
    /usr/local/go/src/os/file_unix.go:221 +0x5a
    os.(_File).ReadAt(0x299487e0, 0x53e5e400, 0x200, 0x200, 0x0, 0x0, 0x0, 0x0, 0x0)
    /usr/local/go/src/os/file.go:117 +0xa0
    runtime error 216 usd, 0x53e5e400, 0x200, 0x200, 0x200, 0x0, 0x0)
    /usr/local/go/src/io/io.go:454 +0xe2
    bytes.(_Buffer).ReadFrom(0x4a31ecc4, 0xaac82338, runtime error 216 usd, 0x7228d680, 0x0, 0x0, 0x0, 0x0)
    /usr/local/go/src/bytes/buffer.go:173 +0x1c3
    io/ioutil.readAll(0xaac82338, 0x7228d680, 0x200, 0x0, 0x0, 0x0, 0x0, 0x0, 0x0)
    /usr/local/go/src/io/ioutil/ioutil.go:33 +0x136
    io/ioutil.ReadAll(0xaac82338, 0x7228d680, 0x0, 0x0, 0x0, 0x0, 0x0)
    /usr/local/go/src/io/ioutil/ioutil.go:42 +0x51
    github.com/restic/restic/repository.(_Repository).SaveFrom(0x189109f0, 0x20a7fc00, 0x4a31ee79, 0x45b92, 0xaac82338, 0x7228d680, 0x0, 0x0)
    error 031 unknown directive +0x2a8
    github.com/restic/restic.(_Archiver).Save(0x3ad50330, 0xa7fc4f00, 0x3fb5ee20, runtime error 216 usd, 0x9ceb2cee, 0xbc4eb1ac, 0x6b741460, 0x76679d67, 0x65fdbb63, 0xb4bcca18, 0xd3. .)
    /tmp/restic-build-875717092/src/github.com/restic/restic/archiver.go:101 +0x2bb
    github.com/restic/restic.(_Archiver).saveChunk(0x3ad50330, 0x7228d660, 0x0, 0x299487e0, 0x587dc060)
    /tmp/restic-build-875717092/src/github.com/restic/restic/archiver.go:162 +0x29c
    created by github.com/restic/restic.(_Archiver).SaveFile
    /tmp/restic-build-875717092/src/github.com/restic/restic/archiver.go:237 +0x360

    goroutine 1061 [runnable]:
    crypto/aes.(_aesCipher).Encrypt(0x697ddd60, 0x5ba81a90, 0x170, 0x170, 0x46b7f460, 0x10, 0x10)
    /usr/local/go/src/crypto/aes/cipher.go:48
    crypto/cipher.(_ctr).refill(0x5f73d050)
    /usr/local/go/src/crypto/cipher/ctr.go:51 +0x168
    crypto/cipher.(_ctr).XORKeyStream(0x5f73d050, 0x85e5c020, 0xedfe0, 0xedfe0, 0x858bc010, 0xec12a, 0x2cddf0)
    /usr/local/go/src/crypto/cipher/ctr.go:69 +0x6b
    github.com/restic/restic/crypto.Encrypt(0x18916140, 0x85d2a000, 0x220000, 0x220000, 0x8578a000, 0x21e13a, 0x3ffe00, 0x0, 0x0, 0x0. .)
    /tmp/restic-build-875717092/src/github.com/restic/restic/crypto/crypto.go:262 +0x52f
    github.com/restic/restic/repository.(_Repository).Encrypt(0x189109f0, 0x359d4000, 0x80000, 0x80000, 0x8578a000, 0x21e13a, 0x3ffe00, 0x0, 0x0, 0x0. .)
    /tmp/restic-build-875717092/src/github.com/restic/restic/repository/repository.go:474 +0x124
    github.com/restic/restic/repository.(_Repository).SaveAndEncrypt(0x189109f0, 0x1b5dd800, 0x8578a000, 0x21e13a, 0x3ffe00, 0x240d2e79, 0x0, 0x0, 0x0, 0x0. .)
    /tmp/restic-build-875717092/src/github.com/restic/restic/repository/repository.go:186 +0x2ea
    github.com/restic/restic/repository.(_Repository).SaveFrom(0x189109f0, 0x9ca8000, 0x240d2e79, 0x21e13a, 0xaac82338, 0x1b5dd8c0, 0x0, 0x0)
    /tmp/restic-build-875717092/src/github.com/restic/restic/repository/repository.go:227 +0x31c
    github.com/restic/restic.(_Archiver).Save(0x3ad50330, 0xca804a00, 0x2d27ff09, 0x837925db, 0x8975cfb5, 0x6534537c, 0xe781069, 0xfb2a99b6, 0x2dbcb162, 0xca. .)
    /tmp/restic-build-875717092/src/github.com/restic/restic/archiver.go:101 +0x2bb
    github.com/restic/restic.(_Archiver).saveChunk(0x3ad50330, 0x1b5dd880, 0x0, 0x3a4967d0, 0x1c2705a0)
    /tmp/restic-build-875717092/src/github.com/restic/restic/archiver.go:162 +0x29c
    created by github.com/restic/restic.(*Archiver).SaveFile
    /tmp/restic-build-875717092/src/github.com/restic/restic/archiver.go:237 +0x360

    goroutine 1078 [semacquire]:
    sync.runtime_Semacquire(0x3ad5033c)
    /usr/local/go/src/runtime/sema.go:43 +0x26
    sync.(_Mutex).Lock(0x3ad50338)
    /usr/local/go/src/sync/mutex.go:82 +0x19f
    github.com/restic/restic.(_Archiver).isKnownBlob(0x3ad50330, 0x1a8ef089, 0x1f7b9da, 0xd072ea21, 0xac5d9d3, 0xdd1fe534, 0xe44e99a4, 0x80b5d023, 0xe32feade, 0x0)
    /tmp/restic-build-875717092/src/github.com/restic/restic/archiver.go:75 +0x49
    github.com/restic/restic.(_Archiver).Save(0x3ad50330, 0x8ef08900, 0xf7b9da1a, 0x72ea2101, 0xc5d9d3d0, 0x1fe5340a, 0x4e99a4dd, 0xb5d023e4, 0x2feade80, 0x5309c4e3. .)
    /tmp/restic-build-875717092/src/github.com/restic/restic/archiver.go:96 +0x16f
    github.com/restic/restic.(_Archiver).saveChunk(0x3ad50330, 0x697ddce0, 0x0, 0x48398570, 0x630eb860)
    /tmp/restic-build-875717092/src/github.com/restic/restic/archiver.go:162 +0x29c
    created by github.com/restic/restic.(*Archiver).SaveFile
    /tmp/restic-build-875717092/src/github.com/restic/restic/archiver.go:237 +0x360

    goroutine 1076 [semacquire]:
    sync.runtime_Semacquire(0x3ad5033c)
    /usr/local/go/src/runtime/sema.go:43 +0x26
    sync.(_Mutex).Lock(0x3ad50338)
    /usr/local/go/src/sync/mutex.go:82 +0x19f
    github.com/restic/restic.(_Archiver).isKnownBlob(0x3ad50330, 0x5b63e4ea, 0xd66e5bde, 0x783d4171, 0xf54f3b3c, 0x98304447, 0xbdf621ea, 0xb746bd48, 0x906e51d, 0x0)
    /tmp/restic-build-875717092/src/github.com/restic/restic/archiver.go:75 +0x49
    github.com/restic/restic.(_Archiver).Save(0x3ad50330, 0x63e4ea00, 0x6e5bde5b, 0x3d4171d6, 0x4f3b3c78, 0x304447f5, 0xf621ea98, 0x46bd48bd, 0x6e51db7, 0x80ae509. .)
    runtime error 216 usd +0x16f
    github.com/restic/restic.(_Archiver).saveChunk(0x3ad50330, 0x23f01740, 0x0, 0x788fce38, 0x23f0a8a0)
    /tmp/restic-build-875717092/src/github.com/restic/restic/archiver.go:162 +0x29c
    created by github.com/restic/restic.(*Archiver).SaveFile
    /tmp/restic-build-875717092/src/github.com/restic/restic/archiver.go:237 runtime error 216 usd 1063 [runnable]:
    crypto/aes.(_aesCipher).Encrypt(0x68f719e0, 0x54764b20, 0xe0, 0xe0, 0x68f754f0, 0x10, 0x10)
    /usr/local/go/src/crypto/aes/cipher.go:48
    crypto/cipher.(_ctr).refill(0x3ad24a50)
    /usr/local/go/src/crypto/cipher/ctr.go:51 +0x168
    crypto/cipher.(_ctr).XORKeyStream(0x3ad24a50, 0x86c8f460, 0x160ba0, 0x160ba0, 0x8682f450, 0x15f8f3, 0x1809b0)
    /usr/local/go/src/crypto/cipher/ctr.go:69 +0x6b
    github.com/restic/restic/crypto.Encrypt(0x18916140, 0x86c10000, 0x1e0000, 0x1e0000, 0x867b0000, 0x1ded43, 0x1ffe00, 0x0, 0x0, 0x0. .)
    /tmp/restic-build-875717092/src/github.com/restic/restic/crypto/crypto.go:262 +0x52f
    github.com/restic/restic/repository.(_Repository).Encrypt(0x189109f0, 0x5f4f8000, 0x80000, 0x80000, 0x867b0000, 0x1ded43, 0x1ffe00, 0x0, 0x0, 0x0. .)
    /tmp/restic-build-875717092/src/github.com/restic/restic/repository/repository.go:474 +0x124
    sig error 35 02 motorola e1, 0x72be4c00, 0x867b0000, 0x1ded43, 0x1ffe00, 0x4a319e79, 0x0, 0x0, 0x0, 0x0. .)
    /tmp/restic-build-875717092/src/github.com/restic/restic/repository/repository.go:186 +0x2ea
    github.com/restic/restic/repository.(_Repository).SaveFrom(0x189109f0, 0xcbf91000, 0x4a319e79, 0x1ded43, 0xaac82338, 0x72be4c20, 0x0, 0x0)
    /tmp/restic-build-875717092/src/github.com/restic/restic/repository/repository.go:227 +0x31c
    github.com/restic/restic.(_Archiver).Save(0x3ad50330, 0xf9106800, 0x165e6acb, 0x76e60787, 0xd8be93b6, 0x1e332d81, 0xafbe2a38, 0x843eee6b, 0x17b6b149, 0x746172d4. .)
    /tmp/restic-build-875717092/src/github.com/restic/restic/archiver.go:101 +0x2bb
    github.com/restic/restic.(_Archiver).saveChunk(0x3ad50330, 0x72be4c00, 0x0, 0x788fce38, 0x72be7f20)
    /tmp/restic-build-875717092/src/github.com/restic/restic/archiver.go:162 +0x29c
    created by github.com/restic/restic.(*Archiver).SaveFile
    /tmp/restic-build-875717092/src/github.com/restic/restic/archiver.go:237 +0x360

    goroutine 1075 [semacquire]:
    sync.runtime_Semacquire(0x3ad5033c)
    /usr/local/go/src/runtime/sema.go:43 +0x26
    sync.(_Mutex).Lock(0x3ad50338)
    /usr/local/go/src/sync/mutex.go:82 +0x19f
    github.com/restic/restic.(_Archiver).isKnownBlob(0x3ad50330, 0x855638dd, 0xbf7b871e, 0xff82aa22, 0xf7320b40, 0x6e825c04, 0x2903aeef, 0xbb15375f, 0xb5e0ab8, 0x0)
    /tmp/restic-build-875717092/src/github.com/restic/restic/archiver.go:75 +0x49
    github.com/restic/restic.(_Archiver).Save(0x3ad50330, 0x5638dd00, 0x7b871e85, 0x82aa22bf, 0x320b40ff, 0x825c04f7, 0x3aeef6e, 0x15375f29, 0x5e0ab8bb, 0xb. .)
    /tmp/restic-build-875717092/src/github.com/restic/restic/archiver.go:96 +0x16f
    github.com/restic/restic.(_Archiver).saveChunk(0x3ad50330, 0x1d09fb00, 0x0, 0x40a8e590, 0x595def00)
    /tmp/restic-build-875717092/src/github.com/restic/restic/archiver.go:162 +0x29c
    created by github.com/restic/restic.(*Archiver).SaveFile
    /tmp/restic-build-875717092/src/github.com/restic/restic/archiver.go:237 +0x360

    goroutine 1073 [semacquire]:
    sync.runtime_Semacquire(0x3ad5033c)
    /usr/local/go/src/runtime/sema.go:43 +0x26
    sync.(_Mutex).Lock(0x3ad50338)
    /usr/local/go/src/sync/mutex.go:82 +0x19f
    github.com/restic/restic.(_Archiver).isKnownBlob(0x3ad50330, 0xd2b0a4c0, 0x7dfdd9ed, 0xdd759cfb, 0x46e0eaaa, 0x6e15a343, 0x7aae0ee8, 0x2cad1aa8, 0x304d4622, 0x0)
    /tmp/restic-build-875717092/src/github.com/restic/restic/archiver.go:75 +0x49
    github.com/restic/restic.(_Archiver).Save(0x3ad50330, 0xb0a4c000, 0xfdd9edd2, 0x759cfb7d, 0xe0eaaadd, 0x15a34346, 0xae0ee86e, 0xad1aa87a, 0x4d46222c, 0x65646130. .)
    /tmp/restic-build-875717092/src/github.com/restic/restic/archiver.go:96 +0x16f
    github.com/restic/restic.(_Archiver).saveChunk(0x3ad50330, runtime error 216 usd, 0x28d8e8a0, 0x0, 0x3a4967d0, 0x28d8db00)
    /tmp/restic-build-875717092/src/github.com/restic/restic/archiver.go:162 +0x29c
    created by github.com/restic/restic.(*Archiver).SaveFile
    /tmp/restic-build-875717092/src/github.com/restic/restic/archiver.go:237 +0x360

    goroutine 1083 [semacquire]:
    sync.runtime_Semacquire(0x3ad5033c)
    /usr/local/go/src/runtime/sema.go:43 +0x26
    sync.(_Mutex).Lock(0x3ad50338)
    /usr/local/go/src/sync/mutex.go:82 +0x19f
    github.com/restic/restic.(_Archiver).isKnownBlob(0x3ad50330, 0x35eaac11, 0xde652b90, 0xe97fb65b, 0xc9eb95d3, 0x7b56c514, 0x8499f48c, 0x9cbbd1e4, 0x456340ba, runtime error 216 usd /tmp/restic-build-875717092/src/github.com/restic/restic/archiver.go:75 +0x49
    github.com/restic/restic.(_Archiver).Save(0x3ad50330, 0xeaac1100, 0x652b9035, 0x7fb65bde, 0xeb95d3e9, 0x56c514c9, 0x99f48c7b, 0xbbd1e484, 0x6340ba9c, 0x3ad5ef45. .)
    /tmp/restic-build-875717092/src/github.com/restic/restic/archiver.go:96 +0x16f
    github.com/restic/restic.(_Archiver).saveChunk(0x3ad50330, 0x62ccf300, 0x0, 0x40a8e590, 0x62cd25a0)
    /tmp/restic-build-875717092/src/github.com/restic/restic/archiver.go:162 +0x29c
    created by github.com/restic/restic.(*Archiver).SaveFile
    /tmp/restic-build-875717092/src/github.com/restic/restic/archiver.go:237 +0x360

    goroutine 1066 [runnable]:
    crypto/aes.(_aesCipher).Encrypt(0x53f36d60, 0x53e5e2a0, 0x160, 0x160, 0x53f3a970, 0x10, 0x10)
    /usr/local/go/src/crypto/aes/cipher.go:48
    crypto/cipher.(_ctr).refill(0x3ad24ab0)
    /usr/local/go/src/crypto/cipher/ctr.go:51 +0x168
    crypto/cipher.(_ctr).XORKeyStream(0x3ad24ab0, 0x87609cf0, 0x27e310, 0x27e310, 0x86ffdce0, 0x27c711, 0x3f2120)
    /usr/local/go/src/crypto/cipher/ctr.go:69 +0x6b
    github.com/restic/restic/crypto.Encrypt(0x18916140, 0x875fc000, 0x28c000, 0x28c000, 0x86ff0000, 0x28a3f1, 0x3ffe00, 0x0, 0x0, 0x0. .)
    /tmp/restic-build-875717092/src/github.com/restic/restic/crypto/crypto.go:262 +0x52f
    github.com/restic/restic/repository.(_Repository).Encrypt(0x189109f0, 0x69f76000, runtime error 216 usd, 0x80000, 0x80000, 0x86ff0000, 0x28a3f1, 0x3ffe00, 0x0, 0x0, 0x0. .)
    /tmp/restic-build-875717092/src/github.com/restic/restic/repository/repository.go:474 +0x124
    github.com/restic/restic/repository.(_Repository).SaveAndEncrypt(0x189109f0, 0x6b023100, 0x86ff0000, 0x28a3f1, 0x3ffe00, 0x18934e79, 0x0, 0x0, 0x0, 0x0. .)
    /tmp/restic-build-875717092/src/github.com/restic/restic/repository/repository.go:186 +0x2ea
    github.com/restic/restic/repository.(_Repository).SaveFrom(0x189109f0, 0x2cee9e00, 0x18934e79, 0x28a3f1, 0xaac82338, 0x6b023100, 0x0, 0x0)
    /tmp/restic-build-875717092/src/github.com/restic/restic/repository/repository.go:227 +0x31c
    github.com/restic/restic.(_Archiver).Save(0x3ad50330, 0xee9eb000, 0x5699332c, 0x360dff4b, 0x721798cb, 0xecf27784, runtime error 216 usd, 0x31eec595, 0xacf567a8, 0x7b625139, 0x5309c4ca. .)
    /tmp/restic-build-875717092/src/github.com/restic/restic/archiver.go:101 +0x2bb
    github.com/restic/restic.(_Archiver).saveChunk(0x3ad50330, 0x6b0230e0, 0x0, 0x40a8e590, 0x54faac60)
    /tmp/restic-build-875717092/src/github.com/restic/restic/archiver.go:162 +0x29c
    created by github.com/restic/restic.(*Archiver).SaveFile
    /tmp/restic-build-875717092/src/github.com/restic/restic/archiver.go:237 +0x360

    goroutine 1077 [semacquire]:
    sync.runtime_Semacquire(0x3ad5033c)
    /usr/local/go/src/runtime/sema.go:43 +0x26
    sync.(_Mutex).Lock(0x3ad50338)
    /usr/local/go/src/sync/mutex.go:82 +0x19f
    github.com/restic/restic.(_Archiver).isKnownBlob(0x3ad50330, 0x38826d5e, 0xafe3ff32, 0x81ebc765, 0xab8ba88a, 0x16c822df, 0xb555f205, 0x554a24de, 0xb25b47de, 0x0)
    /tmp/restic-build-875717092/src/github.com/restic/restic/archiver.go:75 +0x49
    github.com/restic/restic.(_Archiver).Save(0x3ad50330, 0x826d5e00, 0xe3ff3238, 0xebc765af, runtime error 216 usd, 0x8ba88a81, 0xc822dfab, 0x55f20516, 0x4a24deb5, 0x5b47de55, 0x626577b2. .)
    /tmp/restic-build-875717092/src/github.com/restic/restic/archiver.go:96 +0x16f
    github.com/restic/restic.(_Archiver).saveChunk(0x3ad50330, 0x23f01840, 0x0, 0x47f40870, 0x23f0a9c0)
    /tmp/restic-build-875717092/src/github.com/restic/restic/archiver.go:162 +0x29c
    created by github.com/restic/restic.(*Archiver).SaveFile
    /tmp/restic-build-875717092/src/github.com/restic/restic/archiver.go:237 +0x360

    goroutine 1068 [semacquire]:
    sync.runtime_Semacquire(0x3ad5033c)
    /usr/local/go/src/runtime/sema.go:43 +0x26
    sync.(_Mutex).Lock(0x3ad50338)
    /usr/local/go/src/sync/mutex.go:82 +0x19f
    github.com/restic/restic.(_Archiver).isKnownBlob(0x3ad50330, 0xa5619b48, 0x2e8d9726, 0x9f89875f, 0x31cd0bc4, 0xcdd88775, 0x8e556f67, 0x72b5a5fe, 0xfc5e7499, 0x0)
    /tmp/restic-build-875717092/src/github.com/restic/restic/archiver.go:75 +0x49
    github.com/restic/restic.(_Archiver).Save(0x3ad50330, 0x619b4800, runtime error 216 usd, 0x8d9726a5, 0x89875f2e, 0xcd0bc49f, 0xd8877531, 0x556f67cd, 0xb5a5fe8e, 0x5e749972, 0x3ad5bffc. .)
    /tmp/restic-build-875717092/src/github.com/restic/restic/archiver.go:96 +0x16f
    github.com/restic/restic.(_Archiver).saveChunk(0x3ad50330, 0x59b05180, 0x0, 0x3a4967d0, 0x59b0cfc0)
    /tmp/restic-build-875717092/src/github.com/restic/restic/archiver.go:162 +0x29c
    created by github.com/restic/restic.(*Archiver).SaveFile
    /tmp/restic-build-875717092/src/github.com/restic/restic/archiver.go:237 +0x360

    goroutine runtime error 216 usd [semacquire]:
    sync.runtime_Semacquire(0x3ad5033c)
    /usr/local/go/src/runtime/sema.go:43 +0x26
    sync.(_Mutex).Lock(0x3ad50338)
    /usr/local/go/src/sync/mutex.go:82 +0x19f
    github.com/restic/restic.(_Archiver).isKnownBlob(0x3ad50330, 0xc5921c4c, 0x12bcda31, 0x3a136b20, 0xb2c2d139, 0xf19e7702, 0x80684b7c, 0xb857d2d2, 0xdb6b65f9, 0x0)
    /tmp/restic-build-875717092/src/github.com/restic/restic/archiver.go:75 +0x49
    github.com/restic/restic.(_Archiver).Save(0x3ad50330, 0x921c4c00, 0xbcda31c5, 0x136b2012, 0xc2d1393a, 0x9e7702b2, 0x684b7cf1, runtime error 216 usd, 0x57d2d280, 0x6b65f9b8, 0xdb. .)
    /tmp/restic-build-875717092/src/github.com/restic/restic/archiver.go:96 +0x16f
    github.com/restic/restic.(_Archiver).saveChunk(0x3ad50330, 0x67f06d40, 0x0, 0x59941b30, 0x67f0f080)
    /tmp/restic-build-875717092/src/github.com/restic/restic/archiver.go:162 +0x29c
    created by github.com/restic/restic.(*Archiver).SaveFile
    /tmp/restic-build-875717092/src/github.com/restic/restic/archiver.go:237 +0x360

    goroutine 1084 [semacquire]:
    sync.runtime_Semacquire(0x3ad5033c)
    /usr/local/go/src/runtime/sema.go:43 +0x26
    sync.(_Mutex).Lock(0x3ad50338)
    /usr/local/go/src/sync/mutex.go:82 +0x19f
    github.com/restic/restic.(_Archiver).isKnownBlob(0x3ad50330, 0x5ab866e2, 0x74a4af1, 0x68119320, 0xa4516a4a, 0xeffe12c2, 0xa650b4a, 0x46c781e7, 0xf5bdd767, 0x0)
    /tmp/restic-build-875717092/src/github.com/restic/restic/archiver.go:75 +0x49
    github.com/restic/restic.(_Archiver).Save(0x3ad50330, 0xb866e200, 0x4a4af15a, 0x11932007, 0x516a4a68, 0xfe12c2a4, 0x650b4aef, 0xc781e70a, 0xbdd76746, 0x746172f5. .)
    /tmp/restic-build-875717092/src/github.com/restic/restic/archiver.go:96 +0x16f
    github.com/restic/restic.(_Archiver).saveChunk(0x3ad50330, 0x68f719a0, 0x0, 0x48398570, 0x651f5bc0)
    /tmp/restic-build-875717092/src/github.com/restic/restic/archiver.go:162 +0x29c
    created by github.com/restic/restic.(*Archiver).SaveFile
    /tmp/restic-build-875717092/src/github.com/restic/restic/archiver.go:237 +0x360

    goroutine 1056 [runnable]:
    github.com/restic/restic/repository.(_packerManager).findPacker(0x189d4460, 0x129282, 0x80000, 0x80000, 0x85f50000)
    /tmp/restic-build-875717092/src/github.com/restic/restic/repository/packer_manager.go:27
    github.com/restic/restic/repository.(_Repository).SaveAndEncrypt(0x189109f0, 0x524af300, 0x85f50000, 0x129262, 0x1ffe00, 0x4a31be79, 0x0, 0x0, 0x0, 0x0. .)
    /tmp/restic-build-875717092/src/github.com/restic/restic/repository/repository.go:192 +0x373
    github.com/restic/restic/repository.(_Repository).SaveFrom(0x189109f0, 0x542cc800, 0x4a31be79, 0x129262, 0xaac82338, 0x524af380, 0x0, 0x0)
    /tmp/restic-build-875717092/src/github.com/restic/restic/repository/repository.go:227 +0x31c
    github.com/restic/restic.(_Archiver).Save(0x3ad50330, 0x2cc83700, 0xaa531554, 0x719965db, 0x2c42900f, 0x829af56, 0x6f82a0b5, 0x30822b37, 0x8090a1bd, 0x7461721a. .)
    /tmp/restic-build-875717092/src/github.com/restic/restic/archiver.go:101 +0x2bb
    github.com/restic/restic.(_Archiver).saveChunk(0x3ad50330, 0x524af360, 0x0, 0x40a8e590, 0x390410e0)
    /tmp/restic-build-875717092/src/github.com/restic/restic/archiver.go:162 +0x29c
    created by github.com/restic/restic.(_Archiver).SaveFile
    /tmp/restic-build-875717092/src/github.com/restic/restic/archiver.go:237 +0x360

    goroutine 1072 [runnable]:
    encoding/hex.EncodeToString(0x240e8684, 0x20, 0x20, 0x0, 0x0)
    /usr/local/go/src/encoding/hex/hex.go:85 +0x4b
    github.com/restic/restic/backend.ID.String(0xa105175b, 0xb122a8a6, 0xf3c92311, 0xbde32b7e, 0x5a21ed66, 0x4c2e91c6, 0x7790fdca, 0x5277a79b, 0x0, 0x0)
    /tmp/restic-build-875717092/src/github.com/restic/restic/backend/id.go:41 +0x4e
    github.com/restic/restic/backend.(_ID).String(0x18bed900, 0x0, 0x0)
    :4 +0x8d
    fmt.(_pp).handleMethods(0x6aba9cb0, 0x76, 0x0, 0x1)
    /usr/local/go/src/fmt/print.go:730 +0x4ba
    fmt.(_pp).printArg(0x6aba9cb0, 0x848bfe0, 0x18bed900, 0x76, 0x0, 0x0)
    /usr/local/go/src/fmt/print.go:806 +0x422
    fmt.(_pp).doPrintf(0x6aba9cb0, 0x85014e0, 0x18, 0x240e8b3c, 0x1, 0x1)
    /usr/local/go/src/fmt/print.go:1219 +0x198c
    fmt.Sprintf(0x85014e0, 0x18, 0x240e8b3c, 0x1, 0x1, 0x0, 0x0)
    /usr/local/go/src/fmt/print.go:203 +0x5f
    fmt.Errorf(0x85014e0, 0x18, 0x240e8b3c, runtime error 216 usd, 0x1, 0x1, 0x0, 0x0)
    /usr/local/go/src/fmt/print.go:212 +0x4f
    github.com/restic/restic/repository.(_Index).Lookup(0x5b2d8f00, 0xa105175b, 0xb122a8a6, 0xf3c92311, 0xbde32b7e, 0x5a21ed66, 0x4c2e91c6, 0x7790fdca, 0x5277a79b, 0x0. .)
    /tmp/restic-build-875717092/src/github.com/restic/restic/repository/index.go:149 +0x5e3
    github.com/restic/restic/repository.(_MasterIndex).Lookup(0x189109c0, 0xa105175b, 0xb122a8a6, 0xf3c92311, 0xbde32b7e, 0x5a21ed66, 0x4c2e91c6, 0x7790fdca, 0x5277a79b, 0x0. .)
    /tmp/restic-build-875717092/src/github.com/restic/restic/repository/master_index.go:31 +0x213
    github.com/restic/restic.(_Archiver).isKnownBlob(0x3ad50330, 0xa105175b, 0xb122a8a6, 0xf3c92311, 0xbde32b7e, 0x5a21ed66, 0x4c2e91c6, 0x7790fdca, 0x5277a79b, 0x0)
    /tmp/restic-build-875717092/src/github.com/restic/restic/archiver.go:84 +0x16b
    github.com/restic/restic.(_Archiver).Save(0x3ad50330, runtime error 216 usd, 0x5175b00, 0x22a8a6a1, 0xc92311b1, 0xe32b7ef3, 0x21ed66bd, 0x2e91c65a, 0x90fdca4c, 0x77a79b77, 0x74617252. .)
    /tmp/restic-build-875717092/src/github.com/restic/restic/archiver.go:96 +0x16f
    github.com/restic/restic.(_Archiver).saveChunk(0x3ad50330, 0x4b3234e0, runtime error 216 usd, 0x0, 0x48398570, 0x4b329da0)
    /tmp/restic-build-875717092/src/github.com/restic/restic/archiver.go:162 +0x29c
    created by github.com/restic/restic.(_Archiver).SaveFile
    /tmp/restic-build-875717092/src/github.com/restic/restic/archiver.go:237 +0x360

    Currency field makes dump when I wrote something on ALV.

    Hi gurus!

    I just faced a problem with ALV.

    I'm using source code as below.

    The point is blue one.

    When I add a row and write something on 'ZINVAMT' field with 'CFIELDNAME' and press enter, dump occurs.

    And when I use 'CURRENCY', dump is not runtime error 216 usd using

    CALL METHOD g_grid->refresh_table_display.

    method after add a row.

    Thanks for your reply.

    Field Catalog code

    PERFORM fill_field_category_detail USING :

    'S' 'FIELDNAME' 'ZINVAMT',

    ' ' 'COLTEXT' 'INV. AMT',

    * ' ' 'REF_TABLE' 'ZMM223',

    * ' ' 'REF_FIELD' 'ZINVAMT',

    ' ' 'EDIT' 'X',

    * ' ' 'CFIELDNAME' 'ZWAERS',

    * ' utf8.cpp error expected declaration before 'CURRENCY' 'USD',

    'E' 'OUTPUTLEN' '11',

    FORM fill_field_category_detail Server connection error 901 hp :

    DATA l_col(40).
    FIELD-SYMBOLS <fs>.
    CONCATENATE 'GS_FCAT-' p_fname INTO l_col.
    ASSIGN (l_col) TO <fs>.
    MOVE runtime error 216 usd TO <fs>.

    IF p_gub = 'E'.
    APPEND gs_fcat TO gt_fieldcat.
    ENDIF.

    error message

    Runtime Errors GETWA_NOT_ASSIGNED

    Error in the ABAP Application Program

    The current ABAP program "CL_GUI_ALV_GRID===============CP" had to be
    terminated because it has
    come across a statement that unfortunately cannot be executed.

    You attempted to access an unassigned field symbol
    (data segment 32782).

    This error may occur if
    - You address a typed field symbol before it has been set with
    ASSIGN
    - You address a field symbol that pointed to the error p08 canon mp250 of an
    internal table that was deleted
    - You runtime error 216 usd a field symbol that was previously reset using
    UNASSIGN or that pointed to a local field that no
    longer exists
    - You address a global function interface, although the
    respective function module is not active - that is, is
    not in the list of active calls. The list of active calls
    socket error connection refused be taken from this short dump.

    If the error occures in a non-modified SAP program, you may be able to
    find an interim solution in an SAP Note.
    If you have access to SAP Notes, carry out a search with the following
    keywords:

    "GETWA_NOT_ASSIGNED" " "
    "CL_GUI_ALV_GRID===============CP" or "CL_GUI_ALV_GRID===============CM03B"
    "SPLIT_GOOD_AND_BAD"

    If you cannot solve the problem yourself and want to send an error
    notification to SAP, include the following information:

    1. The description of the current problem (short dump)

    To save the description, choose "System->List->Save->Local File
    (Unconverted)".

    2. Corresponding system log

    Display the system log by calling transaction SM21.
    Restrict the time interval to 10 minutes before and five minutes
    after the short dump. Then choose "System->List->Save->Local File
    (Unconverted)".

    3. If the problem occurs in a problem of your own or a modified SAP
    program: The source code of the program
    In the editor, choose "Utilities->More
    Utilities->Upload/Download->Download".

    4. Details about the conditions under which the error occurred or which
    actions and input led to the error.

    209

    210 * If field has not DDIC referencen

    211 if ls_fieldcat-ref_table is initial.

    212 *-- Formal field check without DDIC reference

    >>>>> call method smtp 550-syntax error 214 exporting

    215 i_currency = <l_currency>

    216 i_value = ls_cells-value

    217 i_row_id = ls_cells-row_id

    218 i_tabix = l_tabix

    219 is_fieldcat = ls_fieldcat

    220 importing

    221 eflg_invalid = eflg_invalid

    runtime error 216 usd changing

    223 c_field = <l_field>

    224 ct_good_cells = et_good_cells

    225 ct_mod_cells = et_mod_cells.

    0 Comments

    Leave a Comment