Runtime error 105 delphi

runtime error 105 delphi

Differences in errors ---------- 6a7,10 > /home/delphi/clangDebug/sumo/src/foreign/fontstash/fontstash.h:353:4: runtime error: unsigned integer overflow. chowdera.com › 2021/04. Runtime Code 105 happens when Installshield fails or crashes whilst it's running, hence its name. It doesn't necessarily mean that the code was.

Runtime error 105 delphi - that necessary

Syntax

function IOResult: Integer;

Description

Delphi has two ways to report an I/O error: runtime errors or the function. By default, Delphi reports I/O errors as runtime errors, and the unit maps runtime errors to exceptions. If you use the or directives to turn off I/O runtime errors, Delphi returns the status of input and output operations in the function. It is the programmer’s responsibility to call to test the success or failure of each I/O procedure or function call.

returns zero for success or an error code for failure. The error code might be a Windows error code, or one of the following Delphi error codes.

Error Number

Description

100

Read past end of file.

101

Disk is full.

102

has not yet been called.

103

The file is closed.

104

File not open for input.

105

File not open for output.

106

Incorrectly formatted input for .

After you call , the I/O result code is reset to zero. is a real function.

Tips and Tricks

  • Each thread keeps its own I/O result code, so be sure to call in the context of the correct thread.

  • It is the programmer’s responsibility to call after each I/O routine. If you don’t check , a subsequent I/O call can overwrite the old error code with a new one.

  • The unit maps I/O errors to the exception. This exception class maps only a few I/O error codes to strings. In a real application, ...

Get Delphi in a Nutshell now with the O’Reilly learning platform.

O’Reilly members experience live online training, plus books, videos, and digital content from nearly 200 publishers.

Start your free trial

keyFinal2=value2

Runtime error 105 at00403b53

1 2 3 4 5 6 7 8 9 10 11 12 13 14 15 16 17 18 19 20 21 22 23 24 25 26 27 28 29 30 31 32 33 34 35 36 37 38 39 40 41 42 43 44 45 46 47 48 49 50 51 52 53 54 55 56 57 58 59 60 61 62 63 64 65 66 67 68 69 70 71 72 73 74 program Project2;   {$APPTYPE CONSOLE}   uses   SysUtils;type     Record_Type =Record         Name :String[10];         SurName :String[20];         Age :Byte;         School :Integer;         ClassNum :Byte;     end;const n=1;var     VikaNumber:integer;     Record_Array :Array[1..n]of Record_Type;     ClassNum :Byte;     RecordNum:Byte;     k:Byte;procedure Input_Data(VikaNumber:byte);beginWriteln('Enter your details', VikaNumber,' :');with Record_Array[ VikaNumber]do  begin   Write(' Enter your name ? ');   Readln(Name);   Write(' surname? ');   Readln(SurName);   Write(' Your age ? ');   Readln(Age);   Write('school ? ');   Readln(School);   Write(' class ? ');   Readln(ClassNum);   Writeln;  end;end;   procedure Write_Data(VikaNumber:byte);beginwith Record_Array[ VikaNumber]do  begin   Writeln(' Name : ',Name);   Writeln(' surname : ',SurName);   Writeln(' age ; ',Age);   Writeln(' School : ',School);   Writeln(' Class : ',ClassNum);  end;end;   beginfor VikaNumber:=1to n do Input_Data(VikaNumber);repeatwrite('number of record [1..',n,']=');Readln(RecordNum);until RecordNum in[1..n]; Writeln;Writeln('Output of ',RecordNum,' students : '); Writeln; Write_Data(RecordNum); Writeln;Writeln('Enter the number of the class : ');Readln(ClassNum); k:=0;for VikaNumber:=1to n doif(Record_Array[ VikaNumber].ClassNum=ClassNum)then  begin   k:=1;   Write_Data(VikaNumber);  end;if k=0thenWriteln('There is no such class'); ReadLn;end.
keyFinal3=value3' into taz 'taz_0' 98a102,105 > Tracer caught signal 11: addr=0x0 pc=0xeae258 sp=0x7eff7f3c1d10 > ==2238==LeakSanitizer has encountered a fatal error. > ==2238==HINT: For debugging, try setting environment variable LSAN_OPTIONS=verbosity=1:log_threads=1 > ==2238==HINT: LeakSanitizer does not work under ptrace (strace, gdb, etc) ---------- Differences in log ---------- 0a1 > Warning: Invalid format of parameter (poly) 2d2 < Warning: Invalid format of parameter (key1)

TEST FAILED on ts-sim-build-ba : TAZElements TAZ inspect shape ( Last six runsJan2021 )

---------- Differences in additionals ---------- 5c5 < <taz id="taz_0" shape="12.00,8.00 9.00,13.00 12.00,18.00 7.00,15.00 2.00,18.00 5.00,13.00 2.00,8.00 7.00,11.00 12.00,8.00" color="blue"/> --- > <taz id="taz_0" shape="12.00,8.00" color="blue"/> ---------- Differences in errors ---------- 6a7,10 > /home/delphi/clangDebug/sumo/src/foreign/fontstash/fontstash.h:353:4: runtime error: unsigned integer overflow: 4292246092 + 4273197664 cannot be represented in type 'unsigned int' > SUMMARY: UndefinedBehaviorSanitizer: undefined-behavior /home/delphi/clangDebug/sumo/src/foreign/fontstash/fontstash.h:353:4 in > /home/delphi/clangDebug/sumo/src/foreign/fontstash/fontstash.h:355:4: runtime error: unsigned integer overflow: 4252001694 + 2094206975 cannot be represented in type 'unsigned int' > SUMMARY: UndefinedBehaviorSanitizer: undefined-behavior /home/delphi/clangDebug/sumo/src/foreign/fontstash/fontstash.h:355:4 in 10a15,20 > /home/delphi/clangDebug/sumo/src/netedit/elements/additional/GNETAZ.cpp:504:27: runtime error: division by zero > SUMMARY: UndefinedBehaviorSanitizer: undefined-behavior /home/delphi/clangDebug/sumo/src/netedit/elements/additional/GNETAZ.cpp:504:27 in > /home/delphi/clangDebug/sumo/src/netedit/elements/additional/GNETAZ.cpp:505:25: runtime error: division by zero > SUMMARY: UndefinedBehaviorSanitizer: undefined-behavior /home/delphi/clangDebug/sumo/src/netedit/elements/additional/GNETAZ.cpp:505:25 in > Error: Shape of a(n) user-supplied shape is broken: the position is neither x,y nor x,y,z. > Debug: Value 'poly' for attribute shape of taz isn't valid 19,26d28 < Debug: Setting new attribute shape '12.00,8.00 9.00,13.00 12.00,18.00 7.00,15.00 2.00,18.00 5.00,13.00 2.00,8.00 7.00,11.00 12.00,8.00' into taz 'taz_0' < GLDebug: Removed object taz:taz_0 from SUMORTree with boundary -8.00,-12.00,32.00,28.00 < GLDebug: Inserted taz:taz_0 into SUMORTree with boundary -18.00,-12.00,32.00,38.00 < Debug: Keys Ctrl+Z (Undo) pressed < Debug: Calling GNEUndoList::undo() < Debug: Setting previous attribute shape '12.00,8.00' into taz 'taz_0' < GLDebug: Removed object taz:taz_0 from SUMORTree with boundary -18.00,-12.00,32.00,38.00 < GLDebug: Inserted taz:taz_0 into SUMORTree with boundary -8.00,-12.00,32.00,28.00 36a39,46 > Debug: Keys Ctrl+Z (Undo) pressed > Debug: Calling GNEUndoList::undo() > Debug: Removing taz 'taz_0' from viewNet > GLDebug: Removed object taz:taz_0 from SUMORTree with boundary -18.00,-12.00,32.00,38.00 > Debug: Keys Ctrl+Y (Redo) pressed > Debug: Calling GNEUndoList::redo() > Debug: Adding taz 'taz_0' into viewNet > GLDebug: Inserted taz:taz_0 into SUMORTree with boundary -18.00,-12.00,32.00,38.00 <truncated after showing first 30 lines> ---------- Differences in log ---------- 1a2 > Error: Shape of a(n) user-supplied shape is broken: the position is neither x,y nor x,y,z.

TEST FAILED on ts-sim-build-ba : TAZElements TAZ inspect_selected blockmove ( Last six runsJan2021 )

---------- Differences in errors ---------- 8a9,12 > /home/delphi/clangDebug/sumo/src/netedit/elements/additional/GNETAZ.cpp:504:27: runtime error: division by zero > SUMMARY: UndefinedBehaviorSanitizer: undefined-behavior /home/delphi/clangDebug/sumo/src/netedit/elements/additional/GNETAZ.cpp:504:27 in > /home/delphi/clangDebug/sumo/src/netedit/elements/additional/GNETAZ.cpp:505:25: runtime error: division by zero > SUMMARY: UndefinedBehaviorSanitizer: undefined-behavior /home/delphi/clangDebug/sumo/src/netedit/elements/additional/GNETAZ.cpp:505:25 in 10a15,18 > /home/delphi/clangDebug/sumo/src/foreign/fontstash/fontstash.h:353:4: runtime error: unsigned integer overflow: 4292246092 + 4273197664 cannot be represented in type 'unsigned int' > SUMMARY: UndefinedBehaviorSanitizer: undefined-behavior /home/delphi/clangDebug/sumo/src/foreign/fontstash/fontstash.h:353:4 in > /home/delphi/clangDebug/sumo/src/foreign/fontstash/fontstash.h:355:4: runtime error: unsigned integer overflow: 4252001694 + 2094206975 cannot be represented in type 'unsigned int' > SUMMARY: UndefinedBehaviorSanitizer: undefined-behavior /home/delphi/clangDebug/sumo/src/foreign/fontstash/fontstash.h:355:4 in 66a75,188 > > ================================================================= > ==7237==ERROR: LeakSanitizer: detected memory leaks > > Direct leak of 512 byte(s) in 2 object(s) allocated from: > #0 0xe7f730 (/home/delphi/clangDebug/sumo/bin/neteditD+0xe7f730) > #1 0x7f2615f678ed (/usr/lib/x86_64-linux-gnu/libfontconfig.so.1+0x1d8ed) > > Direct leak of 440 byte(s) in 1 object(s) allocated from: > #0 0xeb7ce0 (/home/delphi/clangDebug/sumo/bin/neteditD+0xeb7ce0) > #1 0x26cbdb6 (/home/delphi/clangDebug/sumo/bin/neteditD+0x26cbdb6) > #2 0xf3a619 (/home/delphi/clangDebug/sumo/bin/neteditD+0xf3a619) > #3 0xf3547e (/home/delphi/clangDebug/sumo/bin/neteditD+0xf3547e) > #4 0xf35037 (/home/delphi/clangDebug/sumo/bin/neteditD+0xf35037) > #5 0xf09a78 (/home/delphi/clangDebug/sumo/bin/neteditD+0xf09a78) > #6 0x15d6a32 (/home/delphi/clangDebug/sumo/bin/neteditD+0x15d6a32) > #7 0x15d4b68 (/home/delphi/clangDebug/sumo/bin/neteditD+0x15d4b68) > #8 0x15d6491 (/home/delphi/clangDebug/sumo/bin/neteditD+0x15d6491) > #9 0x15d4b68 (/home/delphi/clangDebug/sumo/bin/neteditD+0x15d4b68) <truncated after showing first 30 lines>

TEST FAILED on ts-sim-build-ba : TAZElements TAZ inspect_selected blockshape ( Last six runsJan2021 )

---------- Differences in errors ---------- 8a9,12 > /home/delphi/clangDebug/sumo/src/netedit/elements/additional/GNETAZ.cpp:504:27: runtime error: division by zero > SUMMARY: UndefinedBehaviorSanitizer: undefined-behavior /home/delphi/clangDebug/sumo/src/netedit/elements/additional/GNETAZ.cpp:504:27 in > /home/delphi/clangDebug/sumo/src/netedit/elements/additional/GNETAZ.cpp:505:25: runtime error: division by zero > SUMMARY: UndefinedBehaviorSanitizer: undefined-behavior /home/delphi/clangDebug/sumo/src/netedit/elements/additional/GNETAZ.cpp:505:25 in 10a15,18 > /home/delphi/clangDebug/sumo/src/foreign/fontstash/fontstash.h:353:4: runtime error: unsigned integer overflow: 4292246092 + 4273197664 cannot be represented in type 'unsigned int' > SUMMARY: UndefinedBehaviorSanitizer: undefined-behavior /home/delphi/clangDebug/sumo/src/foreign/fontstash/fontstash.h:353:4 in > /home/delphi/clangDebug/sumo/src/foreign/fontstash/fontstash.h:355:4: runtime error: unsigned integer overflow: 4252001694 + 2094206975 cannot be represented in type 'unsigned int' > SUMMARY: UndefinedBehaviorSanitizer: undefined-behavior /home/delphi/clangDebug/sumo/src/foreign/fontstash/fontstash.h:355:4 in 66a75,188 > > ================================================================= > ==7643==ERROR: LeakSanitizer: detected memory leaks > > Direct leak of 512 byte(s) in 2 object(s) allocated from: > #0 0xe7f730 (/home/delphi/clangDebug/sumo/bin/neteditD+0xe7f730) > #1 0x7fc0a90f18ed (/usr/lib/x86_64-linux-gnu/libfontconfig.so.1+0x1d8ed) > > Direct leak of 440 byte(s) in 1 object(s) allocated from: > #0 0xeb7ce0 (/home/delphi/clangDebug/sumo/bin/neteditD+0xeb7ce0) > #1 0x26cbdb6 (/home/delphi/clangDebug/sumo/bin/neteditD+0x26cbdb6) > #2 0xf3a619 (/home/delphi/clangDebug/sumo/bin/neteditD+0xf3a619) > #3 0xf3547e (/home/delphi/clangDebug/sumo/bin/neteditD+0xf3547e) > #4 0xf35037 (/home/delphi/clangDebug/sumo/bin/neteditD+0xf35037) > #5 0xf09a78 (/home/delphi/clangDebug/sumo/bin/neteditD+0xf09a78) > #6 0x15d6a32 (/home/delphi/clangDebug/sumo/bin/neteditD+0x15d6a32) > #7 0x15d4b68 (/home/delphi/clangDebug/sumo/bin/neteditD+0x15d4b68) > #8 0x15d6491 (/home/delphi/clangDebug/sumo/bin/neteditD+0x15d6491) > #9 0x15d4b68 (/home/delphi/clangDebug/sumo/bin/neteditD+0x15d4b68) <truncated after showing first 30 lines>

TEST FAILED on ts-sim-build-ba : TAZElements TAZ inspect_selected color ( Last six runsJan2021 )

---------- Differences in additionals ---------- 5,6c5,6 < <taz id="TAZ_0" shape="12.00,8.00 12.00,18.00 2.00,18.00 2.00,8.00 12.00,8.00" color="125,60,200"/> < <taz id="TAZ_1" shape="32.00,8.00 32.00,18.00 22.00,18.00 22.00,8.00 32.00,8.00" color="125,60,200"/> --- > <taz id="TAZ_0" shape="12.00,8.00 12.00,18.00 2.00,18.00 2.00,8.00 12.00,8.00" color="blue"/> > <taz id="TAZ_1" shape="32.00,8.00 32.00,18.00 22.00,18.00 22.00,8.00 32.00,8.00" color="blue"/> ---------- Differences in errors ---------- 8a9,12 > /home/delphi/clangDebug/sumo/src/netedit/elements/additional/GNETAZ.cpp:504:27: runtime error: division by zero > SUMMARY: UndefinedBehaviorSanitizer: undefined-behavior /home/delphi/clangDebug/sumo/src/netedit/elements/additional/GNETAZ.cpp:504:27 in > /home/delphi/clangDebug/sumo/src/netedit/elements/additional/GNETAZ.cpp:505:25: runtime error: division by zero > SUMMARY: UndefinedBehaviorSanitizer: undefined-behavior /home/delphi/clangDebug/sumo/src/netedit/elements/additional/GNETAZ.cpp:505:25 in 10a15,19 > /home/delphi/clangDebug/sumo/src/foreign/fontstash/fontstash.h:353:4: runtime error: unsigned integer overflow: 4292246092 + 4273197664 cannot be represented in type 'unsigned int' > SUMMARY: UndefinedBehaviorSanitizer: undefined-behavior /home/delphi/clangDebug/sumo/src/foreign/fontstash/fontstash.h:353:4 in > /home/delphi/clangDebug/sumo/src/foreign/fontstash/fontstash.h:355:4: runtime error: unsigned integer overflow: 4252001694 + 2094206975 cannot be represented in type 'unsigned int' > SUMMARY: UndefinedBehaviorSanitizer: undefined-behavior /home/delphi/clangDebug/sumo/src/foreign/fontstash/fontstash.h:355:4 in > Debug: Value 'keyFinal1=value1

The Wiert Corner – irregular stream of stuff

Since I always forget where to get the full list: there is none in the documentation. Only parts.

Usually the mapping is from run-time errors to exceptions:

In addition, exceptions are converted to run-time errors when the exception handling mechanism in the unit is not up.

This can happen early in start-up, or late un shut-down of an application.

The one I encountered most is the runtime error 216 during shutdown: it is an Access Violation (EAccessViolation).

Run-time errors (not changed since Delphi 2007)

  • [WayBack] Delphi 2007: Exceptions

    When an application uses the  unit, most runtime errors are automatically converted into exceptions. Many errors that would otherwise terminate an application – such as insufficient memory, division by zero, and general protection faults – can be caught and handled.

  • [WayBack] Delphi 2007: Delphi Runtime Errors

    Runtime errors take the form:

    Runtime error nnn at xxxxxxxx

    where is the runtime error number, and is the runtime error address.

    Applications that use the SysUtils class map most runtime errors to Exceptions, which allow your application to resolve the error without terminating.

    Delphi runtime errors are divided into the following categories:

    • I/O errors, numbered 100 through 149
    • Fatal errors, numbered 200 through 255
    • Operating system errors

     

  • [WayBack] Delphi 2007: I/O Errors

    I/O errors cause an exception to be thrown if a statement is compiled in the state. (If the application does not include the class, the exception causes the application to terminate).

    In the state, the program continues to execute, and the error is reported by the function.

    Number

    Name

    Description

    100

    Disk read error

    Reported by Read on a typed file if you attempt to read past the end of the file.

    101

    Disk write error

    Reported by CloseFile, Write, WriteIn, or Flush if the disk becomes full.

    102

    File not assigned

    Reported by Reset, Rewrite, Append, Rename, or Erase if the file variable has not been assigned a name through a call to Assign or AssignFile.

    103

    File not open

    Reported by CloseFile, Read Write, Seek, Eof, FilePos, FileSize, Flush, BlockRead, or BlockWrite if the file is not open.

    104

    File not open for input

    Reported by Read, Readln, Eof, Eoln, SeekEof, or SeekEoln on a text file if the file is not open for input.

    105

    File not open for output

    Reported by Write or Writeln on a text file if you do not generate a Console application.

    106

    Invalid numeric format

    Reported by Read or Readln if a numeric value read from a text file does not conform to the proper numeric format.

  • [WayBack] Delphi 2007: Fatal errors

    Number

    Name

    Exception

    200

    Division by zero

    EDivByZero

    201

    Range check error

    ERangeError

    202

    Stack overflow

    EStackOverflow

    203

    Heap overflow error

    EOutOfMemory

    204

    Invalid pointer operation

    EInvalidPointer

    205

    Floating point overflow

    EOverflow

    206

    Floating point underflow

    EUnderflow

    207

    Invalid floating point operation

    EInvalidOp

    210

    Abstract Method Error

    EAbstractError

    215

    Arithmetic overflow (integer only)

    EIntOverflow

    216

    Access violation

    EAccessViolation

    217

    Control-C

    EControlC

    218

    Privileged instruction

    EPrivilege

    219

    Invalid typecast

    EInvalidCast

    220

    Invalid variant typecast

    EVariantError

    221

    Invalid variant operation

    EVariantError

    222

    No variant method call dispatcher

    EVariantError

    223

    Cannot create variant array

    EVariantError

    224

    Variant does not contain array

    EVariantError

    225

    Variant array bounds error

    EVariantError

    226

    TLS initialization error

    No exception to map to.

    227

    Assertion failed

    EAssertionFailed

    228

    Interface Cast Error

    EIntfCastError

    229

    Safecall error

    ESafecallException

    230

    Unhandled exception

    No exception to map to.

    231

    Too many nested exceptions

    Up to 16 permitted.

    232

    Fatal signal raised on a non-Delphi thread

    No exception to map to.

For completeness, some DOS Borland/Turbo Pascal errors from [WayBack] where are the runtime error codes, eh? – delphi

Borland Pascal 7 runtime errors; most applicable to Delphi:
*** DOS ***
1   Invalid function number
2   File not found
3   Path not found
4   Too many open files
5   File access denied
6   Invalid file handle
12  Invalid file access code
15  Invalid drive number
16  Cannot remove current directory
17  Cannot rename across drives
18  No more files
*** I/O ***
100 Disc read error
101 Disc write error
102 File not assigned
103 File not open
104 File not open for input
105 File not open for output
106 Invalid numeric format read from file
*** CRITICAL ***
150 Write protected
151 Unknown unit/Bad drive request struct length
152 Drive not ready
153 Unknown command
154 CRC error in data
155 Bad drive request structure length
156 Disc seek error
157 Unknown media type
158 Sector not found
159 Printer out of paper
160 Device write fault
161 Device read fault
162 Hardware failure (C-DOS: file/device opened by another process)
*** FATAL ***
200 Division by zero
201 Range check
202 Stack overflow (on entry to a procedure or function)
203 Heap overflow (from New() or GetMem())
204 Invalid pointer operation (from Dispose() or FreeMem())
205 Floating point overflow
206 Floating point underflow
207 Invalid floating point operation
208 Overlay manager not installed (usually when calling OvrInit)
209 Overlay file read error
210 Object not initialized
211 Call to abstract method
212 Stream registration error
213 Collection index out of range
214 Collection overflow error
215 Arithmetic overflow error
216 General Protection fault

The run-time error 216

How to fix the Runtime Code 105 Runtime error 105 delphi Error Code 105

Last Updated:

03/07/21 02:48 : A Android user voted that repair method 1 worked for them.


Recommended Repair Tool:


This repair tool can fix common computer problems such as blue screens, crashes and freezes, missing DLL files, as well as repair malware/virus damage and more by replacing damaged and missing system files.


STEP 1:
Click Here to Downloadand install the Windows repair tool.

STEP 2:
Click on Start Scanand let it analyze your device.

STEP 3:
Click on Repair Allto fix all of the issues it detected.

DOWNLOAD NOW

Compatibility

Requirements
1 Ghz CPU, 512 MB RAM, runtime error 105 delphi, 40 GB HDD
This download offers unlimited scans of your Windows PC for free. Full system repairs runtime error 105 delphi at $19.95.

Article ID: ACX05188EN


Applies To: Windows 10, Windows 8.1, Windows 7, Windows Runtime error 105 delphi, Windows XP, Windows 2000



Speed Up Tip #30

Protecting Wireless Internet Connection from Unauthorized Usage:

Unauthorized usage of your wireless Internet connection can cause your internet speed to slow down significantly. If you suspect someone else is connecting to your runtime error 105 delphi network, check your router's device management dashboard, runtime error 105 delphi. You can also change your router's password v3i sw sig error to further secure your connection.

Click Here for another way to speed up your Windows PC

The Wiert Corner – irregular stream of stuff

Since I always forget where to get the full list: there is none in the documentation. Only parts.

Usually the mapping is from run-time errors to exceptions:

In addition, exceptions are converted to run-time errors when the exception handling mechanism in the unit is not up.

This can happen early in start-up, or late un shut-down of an application.

The one I encountered most is the runtime error 216 during shutdown: it is an Access Violation (EAccessViolation).

Run-time errors (not changed since Delphi 2007)

  • [WayBack] Delphi 2007: Exceptions

    When an application uses the  unit, runtime error 105 delphi, most runtime errors are automatically converted into exceptions. Many errors that would otherwise terminate runtime error 105 delphi application – such as insufficient memory, division by zero, and general protection faults – can runtime error 105 delphi caught and handled.

  • [WayBack] Delphi 2007: Delphi Runtime Errors

    Runtime errors take the form:

    Runtime error nnn at xxxxxxxx

    where is the runtime error number, and is the runtime error address.

    Applications that use the SysUtils class map most runtime errors to Exceptions, which allow your application to resolve the error without terminating.

    Delphi runtime errors are divided into the following categories:

    • I/O errors, numbered 100 through 149
    • Fatal errors, numbered 200 through 255
    • Operating system errors

     

  • [WayBack] Delphi 2007: I/O Errors

    I/O errors cause an exception to be thrown if a statement is compiled in the state. (If the application does not include the class, the exception causes the application to terminate).

    In the state, the program continues to execute, and the error is reported by the function.

    Number

    Name

    Description

    100

    Disk read error

    Reported by Read on a typed file if you attempt to read past the end of the file.

    101

    Disk write error

    Reported by CloseFile, Write, WriteIn, or Flush if the runtime error 105 delphi becomes full.

    102

    File not assigned

    Reported by Reset, Rewrite, Append, Rename, or Erase if the file variable has not been assigned a name through a call to Assign or AssignFile.

    103

    File not open

    Reported by CloseFile, Read Write, Seek, runtime error 105 delphi, Eof, FilePos, FileSize, Flush, BlockRead, or BlockWrite if the file is not open.

    104

    File not open for input

    Reported by Read, Readln, runtime error 105 delphi, Eof, Eoln, SeekEof, or SeekEoln on a text file if the file is not open for input.

    105

    File not open for output

    Reported by Write or Writeln on a text file if you do not generate a Console application.

    106

    Invalid numeric format

    Reported by Read or Readln if a numeric value read from a text file does not conform to the proper numeric format.

  • [WayBack] Delphi 2007: Fatal errors

    Number

    Name

    Exception

    200

    Division by zero

    EDivByZero

    201

    Range check error

    ERangeError

    202

    Stack overflow

    EStackOverflow

    203

    Heap overflow error

    EOutOfMemory

    204

    Invalid pointer operation

    EInvalidPointer

    205

    Floating point overflow

    EOverflow

    206

    Floating point underflow

    EUnderflow

    207

    Invalid floating point operation

    EInvalidOp

    210

    Abstract Method Error

    EAbstractError

    215

    Arithmetic overflow (integer only)

    EIntOverflow

    216

    Access violation

    EAccessViolation

    217

    Control-C

    EControlC

    218

    Privileged instruction

    EPrivilege

    219

    Invalid typecast

    EInvalidCast

    220

    Invalid variant typecast

    EVariantError

    221

    Invalid variant operation

    EVariantError

    222

    No variant method call dispatcher

    EVariantError

    223

    Cannot create variant array

    EVariantError

    224

    Variant does not contain array

    EVariantError

    225

    Variant array bounds error

    EVariantError

    226

    TLS initialization error

    No exception to map to.

    227

    Assertion failed

    EAssertionFailed

    228

    Interface Cast Error

    EIntfCastError

    229

    Safecall error

    ESafecallException

    230

    Unhandled exception

    No exception to map to.

    231

    Too many nested exceptions

    Up to 16 permitted.

    232

    Fatal signal raised on a non-Delphi thread

    No exception to map to.

For completeness, some DOS Borland/Turbo Pascal errors from [WayBack] where are the runtime error codes, eh? – delphi

Borland Pascal 7 runtime errors; most applicable to Delphi:
*** DOS ***
1   Invalid function number
2   File not found
3   Path not found
4   Too many open files
5   File access denied
6   Invalid file handle
12  Invalid file access code
15  Invalid drive number
16  Cannot remove current directory
17  Cannot rename across drives
18  No more files
*** I/O ***
runtime error 105 delphi Disc read error
101 Disc write error
102 File not assigned
103 File not open
104 File not open for input
105 File not open for output
106 Invalid numeric format read from file
*** CRITICAL ***
150 Write protected
151 Unknown unit/Bad drive request struct length
152 Drive not ready
153 Unknown command
154 CRC error in data
155 Bad drive request structure length
156 Disc seek error
157 Unknown media type
158 Sector not found
159 Printer out of paper
160 Device write fault
161 Device read fault
162 Hardware failure (C-DOS: file/device opened by another process)
*** FATAL ***
200 Division by zero
201 Range check
202 Stack overflow (on entry to a procedure or function)
203 Heap overflow (from New() or GetMem())
204 Invalid pointer operation (from Dispose() or FreeMem())
205 Floating point overflow
206 Floating point underflow
207 Invalid floating point operation
208 Overlay manager not installed (usually when calling OvrInit)
209 Overlay file read error
210 Object not initialized
211 Call to abstract method
212 Stream registration error
213 Collection index out of range
214 Collection overflow error
215 Arithmetic overflow error
216 General Protection fault

The run-time error 216



 Runtime Error 105 

AuthorMessage

Claus Beh
#1 / 3

 Runtime Error 105

Hi!
Im just starting with Turbo Pascal. I started the Editor with BPW
(Borland Pascal Windows, i assume) and compiled sucessfully. When i try
to start the Programm, i get Runtime Error 105 at 0001:0036.
I use win98 SE, Borland Pascal for windows 7.0.

Is this a common error. What can i do to fix it?

Thanks for your help

Claus



Thu, 17 Mar 2005 20:07:29 GMT 

Dr John Stockto
#2 / 3

 Runtime Error 105


Sun, 29 Sep 2002 14:07:29 :-

Quote:

>Im just starting with Turbo Pascal. I started the Editor with BPW
>(Borland Pascal Windows, runtime error 105 delphi, i assume) and compiled sucessfully. When i try
>to start the Programm, i get Runtime Error 105 at 0001:0036.
>I use win98 SE, Borland Pascal for windows 7.0.

>Is this a common error. What can i do to fix it?

Yes, you are probably using Write or Writeln, with nothing to write to;
or Read/Readln.  The online Help should help.

You might find it easier to learn with BP instead of BPW, working in a
DOS prompt box.  Then you will have simpler I/O, but not Windows-style
GUI.

For a Windows program, probably generally better to use Delphi.

--

  <URL:http://www.merlyn.demon.co.uk/> TP/BP/Delphi/&c., FAQqy topics & links;
  <URL:http://www.merlyn.demon.co.uk/clpb-faq.txt> Pedt Scragg: c.l.p.b. mFAQ;
  <URL:ftp://garbo.uwasa.fi/pc/link/tsfaqp.zip> Timo Salmi's Turbo Pascal FAQ.



Wed, runtime error 105 delphi, 23 Mar 2005 03:18:21 GMT 

bloove
#3 / 3

 Runtime Error 105

Quote:




> Sun, runtime error 105 delphi, 29 Sep 2002 14:07:29 :-

> >Im just starting with Turbo Pascal. I started the Editor with BPW
runtime error 105 delphi >(Borland Pascal Windows, i assume) and compiled sucessfully. When i try
> >to start the Programm, runtime error 105 delphi, i get Runtime Error 105 at 0001:0036.
> >I use win98 SE, Borland Pascal for windows 7.0.

> >Is this a common error. What can i do to fix it?

> Yes, you are probably using Write or Writeln, with nothing to write to;
> or Read/Readln.  The online Help should help.

> You might find it easier to learn with BP instead of BPW, working in a
> DOS prompt box, runtime error 105 delphi.  Then you will have simpler I/O, but not Windows-style
> GUI.

> For a Windows program, probably generally better to use Delphi.

give fpc a try - it has what you want


Wed, 23 Mar 2005 07:17:30 GMT 
 
 Page 1 of 1
 [ 3 post ] 

 Relevant Pages 


03Jan21rv1_8_0+0411-5b405151e5 - detailed test results for NETEDIT

To reconnect the TextTest GUI to these results, runtime error 105 delphi, run:

texttest -a netedit -d /home/delphi/clangDebug/sumo/tests -reconnect /home/delphi/clangDebug/texttesttmp/clang3_64D.31Jan030503.15069 -g

To start TextTest for these tests, run:

texttest -a netedit -d /home/delphi/clangDebug/sumo/tests


gui: 2802 tests: 1 succeeded 2565 FAILED 236 known bugs

Detailed information for the tests that FAILED:

TEST FAILED on ts-sim-build-ba : TAZElements TAZ create block_move ( Last six runsJan2021 )

---------- Differences in errors ---------- 6a7,10 > /home/delphi/clangDebug/sumo/src/foreign/fontstash/fontstash.h:353:4: runtime error: unsigned integer overflow: 4292246092 + 4273197664 cannot be represented in type 'unsigned int' > SUMMARY: Runtime error 105 delphi undefined-behavior /home/delphi/clangDebug/sumo/src/foreign/fontstash/fontstash.h:353:4 in > /home/delphi/clangDebug/sumo/src/foreign/fontstash/fontstash.h:355:4: runtime error: unsigned integer overflow: 4252001694 + 2094206975 cannot be represented in type 'unsigned int' > SUMMARY: UndefinedBehaviorSanitizer: undefined-behavior /home/delphi/clangDebug/sumo/src/foreign/fontstash/fontstash.h:355:4 in 10a15,18 > /home/delphi/clangDebug/sumo/src/netedit/elements/additional/GNETAZ.cpp:504:27: runtime error: division by zero > SUMMARY: UndefinedBehaviorSanitizer: undefined-behavior /home/delphi/clangDebug/sumo/src/netedit/elements/additional/GNETAZ.cpp:504:27 in > /home/delphi/clangDebug/sumo/src/netedit/elements/additional/GNETAZ.cpp:505:25: runtime error: division by zero > SUMMARY: UndefinedBehaviorSanitizer: undefined-behavior /home/delphi/clangDebug/sumo/src/netedit/elements/additional/GNETAZ.cpp:505:25 in 49a58,61 > Tracer caught signal 11: addr=0x0 pc=0xeae258 sp=0x7f7aff2cbd10 > ==32303==LeakSanitizer has encountered a fatal error. > ==32303==HINT: For debugging, try setting environment variable LSAN_OPTIONS=verbosity=1:log_threads=1 > ==32303==HINT: LeakSanitizer does not work under ptrace (strace, runtime error 105 delphi, gdb, etc)

TEST FAILED on ts-sim-build-ba : TAZElements TAZ create block_shape ( Last six runsJan2021 )

---------- Differences in errors ---------- 6a7,10 > /home/delphi/clangDebug/sumo/src/foreign/fontstash/fontstash.h:353:4: runtime error: unsigned integer overflow: 4292246092 + 4273197664 cannot be represented in type 'unsigned int' > SUMMARY: UndefinedBehaviorSanitizer: undefined-behavior /home/delphi/clangDebug/sumo/src/foreign/fontstash/fontstash.h:353:4 in > /home/delphi/clangDebug/sumo/src/foreign/fontstash/fontstash.h:355:4: runtime error: unsigned integer overflow: 4252001694 + 2094206975 cannot be represented in type 'unsigned int' > SUMMARY: UndefinedBehaviorSanitizer: undefined-behavior /home/delphi/clangDebug/sumo/src/foreign/fontstash/fontstash.h:355:4 in 10a15,18 > /home/delphi/clangDebug/sumo/src/netedit/elements/additional/GNETAZ.cpp:504:27: runtime error: division by zero > SUMMARY: UndefinedBehaviorSanitizer: undefined-behavior /home/delphi/clangDebug/sumo/src/netedit/elements/additional/GNETAZ.cpp:504:27 in > /home/delphi/clangDebug/sumo/src/netedit/elements/additional/GNETAZ.cpp:505:25: runtime error: division by zero > SUMMARY: UndefinedBehaviorSanitizer: undefined-behavior /home/delphi/clangDebug/sumo/src/netedit/elements/additional/GNETAZ.cpp:505:25 in 49a58,61 > Tracer caught signal 11: addr=0x0 pc=0xeae258 sp=0x7f81c68fed10 > ==32274==LeakSanitizer has encountered a fatal error. > ==32274==HINT: For debugging, try setting environment variable LSAN_OPTIONS=verbosity=1:log_threads=1 > ==32274==HINT: LeakSanitizer does not work under ptrace (strace, gdb, etc)

TEST FAILED on ts-sim-build-ba : TAZElements TAZ create color ( Last six runsJan2021 )

---------- Differences in additionals ---------- 6d5 < <taz id="taz_1" shape="22.00,18.00 22.00,24.00 16.00,24.00 16.00,18.00 22.00,18.00" color="red"/> ---------- Differences in errors ---------- 6a7,10 > /home/delphi/clangDebug/sumo/src/foreign/fontstash/fontstash.h:353:4: runtime error: unsigned integer overflow: 4292246092 + 4273197664 cannot be represented in type 'unsigned int' > SUMMARY: UndefinedBehaviorSanitizer: undefined-behavior /home/delphi/clangDebug/sumo/src/foreign/fontstash/fontstash.h:353:4 in > /home/delphi/clangDebug/sumo/src/foreign/fontstash/fontstash.h:355:4: runtime error: unsigned integer overflow: 4252001694 + 2094206975 cannot be represented in type 'unsigned int' > SUMMARY: UndefinedBehaviorSanitizer: undefined-behavior /home/delphi/clangDebug/sumo/src/foreign/fontstash/fontstash.h:355:4 in 10a15,18 > /home/delphi/clangDebug/sumo/src/netedit/elements/additional/GNETAZ.cpp:504:27: runtime error: division by zero > SUMMARY: UndefinedBehaviorSanitizer: undefined-behavior /home/delphi/clangDebug/sumo/src/netedit/elements/additional/GNETAZ.cpp:504:27 in > /home/delphi/clangDebug/sumo/src/netedit/elements/additional/GNETAZ.cpp:505:25: runtime error: division by zero > SUMMARY: UndefinedBehaviorSanitizer: undefined-behavior /home/delphi/clangDebug/sumo/src/netedit/elements/additional/GNETAZ.cpp:505:25 in 15,20d22 < Debug: Adding taz 'taz_1' into viewNet < GLDebug: Inserted taz:taz_1 into SUMORTree with boundary -4.00,-2.00,42.00,44.00 < Debug: Keys Ctrl+Z (Undo) pressed < Debug: Calling GNEUndoList::undo() < Debug: Removing taz 'taz_1' from viewNet < GLDebug: Removed object taz:taz_1 from SUMORTree with boundary -4.00,-2.00,42.00,44.00 24a27 > Debug: Keys Ctrl+Z (Undo) pressed 30,32d32 < Debug: Calling GNEUndoList::redo() < Debug: Adding taz 'taz_1' into viewNet < GLDebug: Inserted taz:taz_1 into SUMORTree with boundary -4.00,-2.00,42.00,44.00 48,50d47 < Debug: Removing taz 'taz_1' from net in ~GNEChange_TAZElement() < GLDebug: Removed object taz:taz_1 from SUMORTree with boundary -4.00,-2.00,42.00,44.00 < Debug: delete taz 'taz_1' in ~GNEChange_TAZElement() 66a64,67 > Tracer caught signal 11: addr=0x0 pc=0xeae258 sp=0x7f3dde556d10 > ==30314==LeakSanitizer has encountered a fatal error. <truncated after showing first 30 lines>

TEST FAILED on ts-sim-build-ba : TAZElements TAZ create default close_line ( Last six runsJan2021 )

---------- Differences in errors ---------- 6a7,10 > /home/delphi/clangDebug/sumo/src/foreign/fontstash/fontstash.h:353:4: runtime error: unsigned integer overflow: 4292246092 + 4273197664 cannot be represented in type 'unsigned int' > SUMMARY: UndefinedBehaviorSanitizer: undefined-behavior /home/delphi/clangDebug/sumo/src/foreign/fontstash/fontstash.h:353:4 in > /home/delphi/clangDebug/sumo/src/foreign/fontstash/fontstash.h:355:4: runtime error: unsigned integer overflow: 4252001694 + 2094206975 cannot be represented in type 'unsigned int' > SUMMARY: UndefinedBehaviorSanitizer: undefined-behavior /home/delphi/clangDebug/sumo/src/foreign/fontstash/fontstash.h:355:4 in 10a15,18 > /home/delphi/clangDebug/sumo/src/netedit/elements/additional/GNETAZ.cpp:504:27: runtime error: division by zero > SUMMARY: UndefinedBehaviorSanitizer: undefined-behavior /home/delphi/clangDebug/sumo/src/netedit/elements/additional/GNETAZ.cpp:504:27 in > /home/delphi/clangDebug/sumo/src/netedit/elements/additional/GNETAZ.cpp:505:25: runtime error: division by zero > SUMMARY: UndefinedBehaviorSanitizer: undefined-behavior /home/delphi/clangDebug/sumo/src/netedit/elements/additional/GNETAZ.cpp:505:25 in 49a58,61 > Tracer caught signal 11: addr=0x0 pc=0xeae258 sp=0x7fc46fc0ed10 > ==28650==LeakSanitizer has encountered a fatal error. > ==28650==HINT: For debugging, try setting environment variable LSAN_OPTIONS=verbosity=1:log_threads=1 > ==28650==HINT: LeakSanitizer does not work under ptrace (strace, gdb, etc)

TEST FAILED on ts-sim-build-ba : TAZElements TAZ create default default ( Last six runsJan2021 )

---------- Differences in errors ---------- 6a7,10 > runtime error 105 delphi runtime error: unsigned integer runtime error 105 delphi 4292246092 + 4273197664 cannot be represented in type 'unsigned int' > SUMMARY: UndefinedBehaviorSanitizer: undefined-behavior /home/delphi/clangDebug/sumo/src/foreign/fontstash/fontstash.h:353:4 in > /home/delphi/clangDebug/sumo/src/foreign/fontstash/fontstash.h:355:4: runtime error: unsigned integer overflow: 4252001694 + 2094206975 cannot be represented in type 'unsigned int' > SUMMARY: UndefinedBehaviorSanitizer: undefined-behavior /home/delphi/clangDebug/sumo/src/foreign/fontstash/fontstash.h:355:4 in 10a15,18 > /home/delphi/clangDebug/sumo/src/netedit/elements/additional/GNETAZ.cpp:504:27: runtime error: division by zero > SUMMARY: UndefinedBehaviorSanitizer: undefined-behavior /home/delphi/clangDebug/sumo/src/netedit/elements/additional/GNETAZ.cpp:504:27 in > /home/delphi/clangDebug/sumo/src/netedit/elements/additional/GNETAZ.cpp:505:25: runtime error: division by zero > SUMMARY: UndefinedBehaviorSanitizer: undefined-behavior /home/delphi/clangDebug/sumo/src/netedit/elements/additional/GNETAZ.cpp:505:25 in 49a58,61 > Tracer runtime error 105 delphi signal 11: addr=0x0 pc=0xeae258 sp=0x7fc5e89add10 > ==27708==LeakSanitizer has encountered a fatal error. > ==27708==HINT: For debugging, runtime error 105 delphi, try setting environment variable LSAN_OPTIONS=verbosity=1:log_threads=1 > ==27708==HINT: LeakSanitizer does not work under ptrace (strace, gdb, etc)

TEST FAILED on ts-sim-build-ba : TAZElements TAZ create default one_point ( Last six runsJan2021 )

---------- Differences in errors error a2008 syntax error in structure 6a7,10 > /home/delphi/clangDebug/sumo/src/foreign/fontstash/fontstash.h:353:4: runtime error: unsigned integer overflow: 4292246092 + 4273197664 cannot be represented in type 'unsigned int' > SUMMARY: UndefinedBehaviorSanitizer: undefined-behavior /home/delphi/clangDebug/sumo/src/foreign/fontstash/fontstash.h:353:4 in > /home/delphi/clangDebug/sumo/src/foreign/fontstash/fontstash.h:355:4: runtime error: unsigned integer overflow: 4252001694 + 2094206975 cannot be represented in type 'unsigned int' > SUMMARY: UndefinedBehaviorSanitizer: undefined-behavior /home/delphi/clangDebug/sumo/src/foreign/fontstash/fontstash.h:355:4 in 8a13,18 > /home/delphi/clangDebug/sumo/src/utils/gui/windows/GUISUMOAbstractView.cpp:1640:40: runtime error: division by zero > SUMMARY: UndefinedBehaviorSanitizer: undefined-behavior /home/delphi/clangDebug/sumo/src/utils/gui/windows/GUISUMOAbstractView.cpp:1640:40 in > /home/delphi/clangDebug/sumo/src/utils/gui/windows/GUISUMOAbstractView.cpp:1641:41: runtime runtime error 105 delphi division by zero > SUMMARY: UndefinedBehaviorSanitizer: undefined-behavior /home/delphi/clangDebug/sumo/src/utils/gui/windows/GUISUMOAbstractView.cpp:1641:41 in > /home/delphi/clangDebug/sumo/src/utils/gui/windows/GUISUMOAbstractView.cpp:778:32: runtime error: division by zero > SUMMARY: UndefinedBehaviorSanitizer: undefined-behavior /home/delphi/clangDebug/sumo/src/utils/gui/windows/GUISUMOAbstractView.cpp:778:32 in 10a21,24 > /home/delphi/clangDebug/sumo/src/netedit/elements/additional/GNETAZ.cpp:504:27: runtime error: division by zero > SUMMARY: UndefinedBehaviorSanitizer: undefined-behavior /home/delphi/clangDebug/sumo/src/netedit/elements/additional/GNETAZ.cpp:504:27 in > /home/delphi/clangDebug/sumo/src/netedit/elements/additional/GNETAZ.cpp:505:25: runtime error: division by zero > SUMMARY: UndefinedBehaviorSanitizer: undefined-behavior /home/delphi/clangDebug/sumo/src/netedit/elements/additional/GNETAZ.cpp:505:25 in 49a64,67 > Tracer caught signal 11: addr=0x0 pc=0xeae258 sp=0x7f8f6d8dbd10 > ==27728==LeakSanitizer has encountered a fatal error. > ==27728==HINT: For debugging, try setting environment variable LSAN_OPTIONS=verbosity=1:log_threads=1 > ==27728==HINT: LeakSanitizer does not work under ptrace (strace, gdb, etc)

TEST FAILED on ts-sim-build-ba : TAZElements TAZ create default runtime error 105 delphi ( Last six runsJan2021 )

---------- Differences in errors ---------- 6a7,10 > /home/delphi/clangDebug/sumo/src/foreign/fontstash/fontstash.h:353:4: runtime error: unsigned integer overflow: 4292246092 + 4273197664 runtime error 105 delphi be represented in type 'unsigned int' > SUMMARY: UndefinedBehaviorSanitizer: undefined-behavior /home/delphi/clangDebug/sumo/src/foreign/fontstash/fontstash.h:353:4 in > /home/delphi/clangDebug/sumo/src/foreign/fontstash/fontstash.h:355:4: runtime error: unsigned integer overflow: 4252001694 + 2094206975 cannot be represented in type 'unsigned int' > SUMMARY: UndefinedBehaviorSanitizer: undefined-behavior /home/delphi/clangDebug/sumo/src/foreign/fontstash/fontstash.h:355:4 in 10a15,18 > /home/delphi/clangDebug/sumo/src/netedit/elements/additional/GNETAZ.cpp:504:27: runtime error: division by zero > SUMMARY: UndefinedBehaviorSanitizer: undefined-behavior /home/delphi/clangDebug/sumo/src/netedit/elements/additional/GNETAZ.cpp:504:27 in > /home/delphi/clangDebug/sumo/src/netedit/elements/additional/GNETAZ.cpp:505:25: runtime error: division by zero > SUMMARY: UndefinedBehaviorSanitizer: undefined-behavior /home/delphi/clangDebug/sumo/src/netedit/elements/additional/GNETAZ.cpp:505:25 in 49a58,61 > Tracer caught signal 11: addr=0x0 pc=0xeae258 sp=0x7f3f5faebd10 > ==27624==LeakSanitizer has encountered a fatal error. > ==27624==HINT: For debugging, try setting environment variable LSAN_OPTIONS=verbosity=1:log_threads=1 > ==27624==HINT: LeakSanitizer does not work under ptrace (strace, gdb, etc)

TEST FAILED on ts-sim-build-ba : TAZElements TAZ create default open_line ( Last six runsJan2021 )

---------- Differences in errors ---------- 6a7,10 > /home/delphi/clangDebug/sumo/src/foreign/fontstash/fontstash.h:353:4: runtime error: unsigned integer overflow: 4292246092 + 4273197664 cannot be represented in type 'unsigned int' > SUMMARY: UndefinedBehaviorSanitizer: undefined-behavior /home/delphi/clangDebug/sumo/src/foreign/fontstash/fontstash.h:353:4 in > /home/delphi/clangDebug/sumo/src/foreign/fontstash/fontstash.h:355:4: runtime error: unsigned integer overflow: 4252001694 + 2094206975 cannot be represented in type 'unsigned int' runtime error 105 delphi SUMMARY: UndefinedBehaviorSanitizer: undefined-behavior /home/delphi/clangDebug/sumo/src/foreign/fontstash/fontstash.h:355:4 in 10a15,18 > /home/delphi/clangDebug/sumo/src/netedit/elements/additional/GNETAZ.cpp:504:27: runtime error: division by zero > SUMMARY: UndefinedBehaviorSanitizer: undefined-behavior /home/delphi/clangDebug/sumo/src/netedit/elements/additional/GNETAZ.cpp:504:27 in > /home/delphi/clangDebug/sumo/src/netedit/elements/additional/GNETAZ.cpp:505:25: runtime error: division by zero > SUMMARY: UndefinedBehaviorSanitizer: undefined-behavior /home/delphi/clangDebug/sumo/src/netedit/elements/additional/GNETAZ.cpp:505:25 in 49a58,61 > Tracer caught signal 11: addr=0x0 pc=0xeae258 sp=0x7efe0e3f6d10 > ==27768==LeakSanitizer has encountered a fatal error. > ==27768==HINT: For debugging, runtime error 105 delphi, try setting environment variable LSAN_OPTIONS=verbosity=1:log_threads=1 > ==27768==HINT: LeakSanitizer does not work under ptrace (strace, gdb, etc)

TEST FAILED on ts-sim-build-ba : TAZElements TAZ create default same_points ( Last six runsJan2021 )

---------- Differences in errors ---------- 6a7,10 > /home/delphi/clangDebug/sumo/src/foreign/fontstash/fontstash.h:353:4: runtime error: unsigned integer overflow: 4292246092 + 4273197664 cannot be represented in type 'unsigned int' > SUMMARY: UndefinedBehaviorSanitizer: undefined-behavior /home/delphi/clangDebug/sumo/src/foreign/fontstash/fontstash.h:353:4 in > /home/delphi/clangDebug/sumo/src/foreign/fontstash/fontstash.h:355:4: runtime error: unsigned integer overflow: 4252001694 + 2094206975 cannot be represented in type 'unsigned int' > SUMMARY: UndefinedBehaviorSanitizer: undefined-behavior /home/delphi/clangDebug/sumo/src/foreign/fontstash/fontstash.h:355:4 in 10a15,18 > /home/delphi/clangDebug/sumo/src/netedit/elements/additional/GNETAZ.cpp:504:27: runtime error: division by zero > SUMMARY: UndefinedBehaviorSanitizer: undefined-behavior /home/delphi/clangDebug/sumo/src/netedit/elements/additional/GNETAZ.cpp:504:27 in > /home/delphi/clangDebug/sumo/src/netedit/elements/additional/GNETAZ.cpp:505:25: runtime error: division by zero > SUMMARY: UndefinedBehaviorSanitizer: undefined-behavior /home/delphi/clangDebug/sumo/src/netedit/elements/additional/GNETAZ.cpp:505:25 in 64a73,76 > Tracer caught signal 11: addr=0x0 pc=0xeae258 sp=0x7f7728dfed10 > ==27682==LeakSanitizer has encountered a fatal error. > ==27682==HINT: For debugging, try setting environment variable LSAN_OPTIONS=verbosity=1:log_threads=1 > ==27682==HINT: LeakSanitizer does not work under ptrace (strace, gdb, etc)

TEST FAILED on ts-sim-build-ba : TAZElements TAZ create edges_within ( Last six runsJan2021 )

---------- Differences in errors ---------- 6a7,10 > /home/delphi/clangDebug/sumo/src/foreign/fontstash/fontstash.h:353:4: runtime error: unsigned integer overflow: 4292246092 + 4273197664 cannot be represented in type 'unsigned int' > SUMMARY: UndefinedBehaviorSanitizer: undefined-behavior /home/delphi/clangDebug/sumo/src/foreign/fontstash/fontstash.h:353:4 in > /home/delphi/clangDebug/sumo/src/foreign/fontstash/fontstash.h:355:4: runtime error: unsigned integer overflow: 4252001694 + 2094206975 cannot be represented in type 'unsigned int' > SUMMARY: UndefinedBehaviorSanitizer: undefined-behavior /home/delphi/clangDebug/sumo/src/foreign/fontstash/fontstash.h:355:4 in 14a19,22 > /home/delphi/clangDebug/sumo/src/netedit/elements/additional/GNETAZ.cpp:504:27: runtime error: division by zero > SUMMARY: UndefinedBehaviorSanitizer: undefined-behavior /home/delphi/clangDebug/sumo/src/netedit/elements/additional/GNETAZ.cpp:504:27 in > /home/delphi/clangDebug/sumo/src/netedit/elements/additional/GNETAZ.cpp:505:25: runtime error: division by zero > SUMMARY: UndefinedBehaviorSanitizer: undefined-behavior /home/delphi/clangDebug/sumo/src/netedit/elements/additional/GNETAZ.cpp:505:25 in 84a93,96 > Tracer caught signal 11: addr=0x0 pc=0xeae258 sp=0x7f572c96dd10 > ==31432==LeakSanitizer has encountered a fatal error, runtime error 105 delphi. > ==31432==HINT: For debugging, try setting environment variable LSAN_OPTIONS=verbosity=1:log_threads=1 > ==31432==HINT: LeakSanitizer does not work under ptrace (strace, gdb, etc)

TEST FAILED on ts-sim-build-ba : TAZElements TAZ delete ( Last six runsJan2021 )

---------- Differences in errors ---------- 2a3,6 > /home/delphi/clangDebug/sumo/src/netedit/elements/additional/GNETAZ.cpp:504:27: runtime error: division by zero > SUMMARY: UndefinedBehaviorSanitizer: undefined-behavior /home/delphi/clangDebug/sumo/src/netedit/elements/additional/GNETAZ.cpp:504:27 in > /home/delphi/clangDebug/sumo/src/netedit/elements/additional/GNETAZ.cpp:505:25: runtime error: division by zero > SUMMARY: UndefinedBehaviorSanitizer: undefined-behavior /home/delphi/clangDebug/sumo/src/netedit/elements/additional/GNETAZ.cpp:505:25 in 3a8,11 > /home/delphi/clangDebug/sumo/src/foreign/fontstash/fontstash.h:353:4: runtime error: unsigned integer overflow: 4292246092 + 4273197664 cannot be represented in type 'unsigned int' > SUMMARY: UndefinedBehaviorSanitizer: undefined-behavior /home/delphi/clangDebug/sumo/src/foreign/fontstash/fontstash.h:353:4 in > /home/delphi/clangDebug/sumo/src/foreign/fontstash/fontstash.h:355:4: runtime error: unsigned integer overflow: 4252001694 cmd copy errorlevel 2094206975 cannot be represented in type 'unsigned int' > SUMMARY: UndefinedBehaviorSanitizer: undefined-behavior /home/delphi/clangDebug/sumo/src/foreign/fontstash/fontstash.h:355:4 in 47a56,169 > > ================================================================= > ==32668==ERROR: LeakSanitizer: detected memory leaks > > Direct leak of 512 byte(s) in 2 object(s) allocated from: > #0 0xe7f730 (/home/delphi/clangDebug/sumo/bin/neteditD+0xe7f730) > #1 0x7fbeccf4c8ed (/usr/lib/x86_64-linux-gnu/libfontconfig.so.1+0x1d8ed) > > Direct leak of 440 byte(s) in 1 object(s) allocated from: > #0 0xeb7ce0 (/home/delphi/clangDebug/sumo/bin/neteditD+0xeb7ce0) > #1 0x26cbdb6 (/home/delphi/clangDebug/sumo/bin/neteditD+0x26cbdb6) > #2 0xf3a619 (/home/delphi/clangDebug/sumo/bin/neteditD+0xf3a619) > #3 0xf3547e (/home/delphi/clangDebug/sumo/bin/neteditD+0xf3547e) > #4 0xf35037 (/home/delphi/clangDebug/sumo/bin/neteditD+0xf35037) > #5 0xf09a78 (/home/delphi/clangDebug/sumo/bin/neteditD+0xf09a78) > #6 0x15d6a32 (/home/delphi/clangDebug/sumo/bin/neteditD+0x15d6a32) > drg-50857 oracle error in dreii0fsh #7 0x15d4b68 (/home/delphi/clangDebug/sumo/bin/neteditD+0x15d4b68) > #8 0x15d6491 (/home/delphi/clangDebug/sumo/bin/neteditD+0x15d6491) > #9 0x15d4b68 (/home/delphi/clangDebug/sumo/bin/neteditD+0x15d4b68) <truncated after showing first 30 lines>

TEST FAILED on ts-sim-build-ba : TAZElements TAZ inspect blockmove ( Last six runsJan2021 )

---------- Differences in errors ---------- 6a7,10 > /home/delphi/clangDebug/sumo/src/foreign/fontstash/fontstash.h:353:4: runtime error: unsigned integer overflow: 4292246092 + 4273197664 cannot be represented runtime error 105 delphi type 'unsigned int' > SUMMARY: UndefinedBehaviorSanitizer: undefined-behavior /home/delphi/clangDebug/sumo/src/foreign/fontstash/fontstash.h:353:4 in > /home/delphi/clangDebug/sumo/src/foreign/fontstash/fontstash.h:355:4: runtime error: unsigned integer overflow: 4252001694 + 2094206975 cannot be represented in type 'unsigned int' > SUMMARY: UndefinedBehaviorSanitizer: runtime error 105 delphi /home/delphi/clangDebug/sumo/src/foreign/fontstash/fontstash.h:355:4 in 10a15,18 > /home/delphi/clangDebug/sumo/src/netedit/elements/additional/GNETAZ.cpp:504:27: runtime error: division by zero > SUMMARY: UndefinedBehaviorSanitizer: undefined-behavior /home/delphi/clangDebug/sumo/src/netedit/elements/additional/GNETAZ.cpp:504:27 in > /home/delphi/clangDebug/sumo/src/netedit/elements/additional/GNETAZ.cpp:505:25: runtime error: division by zero > SUMMARY: UndefinedBehaviorSanitizer: undefined-behavior /home/delphi/clangDebug/sumo/src/netedit/elements/additional/GNETAZ.cpp:505:25 in 56a65,68 > Tracer caught signal 11: addr=0x0 pc=0xeae258 sp=0x7f3e5b746d10 > ==2951==LeakSanitizer has encountered a fatal error. > ==2951==HINT: For debugging, try setting environment variable LSAN_OPTIONS=verbosity=1:log_threads=1 > ==2951==HINT: LeakSanitizer does not work under ptrace (strace, gdb, etc)

TEST FAILED on ts-sim-build-ba : TAZElements TAZ inspect blockshape ( Last six runsJan2021 )

---------- Differences in errors ---------- 6a7,10 > /home/delphi/clangDebug/sumo/src/foreign/fontstash/fontstash.h:353:4: runtime error: unsigned integer overflow: 4292246092 + 4273197664 cannot be represented in type 'unsigned int' > SUMMARY: UndefinedBehaviorSanitizer: undefined-behavior /home/delphi/clangDebug/sumo/src/foreign/fontstash/fontstash.h:353:4 in > /home/delphi/clangDebug/sumo/src/foreign/fontstash/fontstash.h:355:4: runtime error: unsigned integer overflow: 4252001694 + 2094206975 cannot be represented in type 'unsigned int' runtime error 105 delphi SUMMARY: UndefinedBehaviorSanitizer: undefined-behavior /home/delphi/clangDebug/sumo/src/foreign/fontstash/fontstash.h:355:4 in 10a15,18 > /home/delphi/clangDebug/sumo/src/netedit/elements/additional/GNETAZ.cpp:504:27: runtime error: division by zero > SUMMARY: UndefinedBehaviorSanitizer: undefined-behavior /home/delphi/clangDebug/sumo/src/netedit/elements/additional/GNETAZ.cpp:504:27 in > /home/delphi/clangDebug/sumo/src/netedit/elements/additional/GNETAZ.cpp:505:25: runtime error: division by zero > SUMMARY: UndefinedBehaviorSanitizer: undefined-behavior /home/delphi/clangDebug/sumo/src/netedit/elements/additional/GNETAZ.cpp:505:25 in 56a65,68 > Tracer caught signal 11: addr=0x0 pc=0xeae258 sp=0x7f1709af3d10 > ==3404==LeakSanitizer has encountered a fatal error. > ==3404==HINT: For debugging, try setting environment variable LSAN_OPTIONS=verbosity=1:log_threads=1 > ==3404==HINT: LeakSanitizer does not work under ptrace (strace, gdb, runtime error 105 delphi, etc)

TEST FAILED on ts-sim-build-ba : TAZElements TAZ inspect color ( Last six runsJan2021 )

---------- Differences in additionals ---------- 5c5 < <taz id="taz_0" shape="12.00,8.00 12.00,18.00 2.00,18.00 2.00,8.00 12.00,8.00" color="125,60,200"/> --- > <taz id="taz_0" shape="12.00,8.00 12.00,18.00 2.00,18.00 2.00,8.00 12.00,8.00" color="blue"/> ---------- Differences in errors ---------- 6a7,10 > /home/delphi/clangDebug/sumo/src/foreign/fontstash/fontstash.h:353:4: runtime error: unsigned integer overflow: 4292246092 + 4273197664 cannot be represented in type 'unsigned int' > SUMMARY: UndefinedBehaviorSanitizer: undefined-behavior /home/delphi/clangDebug/sumo/src/foreign/fontstash/fontstash.h:353:4 in > /home/delphi/clangDebug/sumo/src/foreign/fontstash/fontstash.h:355:4: runtime error: unsigned integer overflow: 4252001694 + 2094206975 cannot be represented in type 'unsigned int' > SUMMARY: UndefinedBehaviorSanitizer: undefined-behavior /home/delphi/clangDebug/sumo/src/foreign/fontstash/fontstash.h:355:4 in 10a15,19 > /home/delphi/clangDebug/sumo/src/netedit/elements/additional/GNETAZ.cpp:504:27: runtime error: division by zero > SUMMARY: UndefinedBehaviorSanitizer: undefined-behavior /home/delphi/clangDebug/sumo/src/netedit/elements/additional/GNETAZ.cpp:504:27 in > /home/delphi/clangDebug/sumo/src/netedit/elements/additional/GNETAZ.cpp:505:25: runtime error: division by zero > SUMMARY: UndefinedBehaviorSanitizer: undefined-behavior /home/delphi/clangDebug/sumo/src/netedit/elements/additional/GNETAZ.cpp:505:25 in > Debug: Value '10' for attribute color of taz isn't valid 14,17d22 < Debug: Setting new attribute color '125,60,200' into taz 'taz_0' < Debug: Keys Ctrl+Z (Undo) pressed < Debug: Calling GNEUndoList::undo() < Debug: Setting previous attribute color 'blue' into taz runtime error 105 delphi 23a29,32 > Debug: Keys Ctrl+Z (Undo) pressed > Debug: Calling GNEUndoList::undo() > Debug: Removing taz 'taz_0' from viewNet > GLDebug: Removed object taz:taz_0 from SUMORTree with boundary -18.00,-12.00,32.00,38.00 26c35,36 < Debug: Setting new attribute color '255,255,500' into taz 'taz_0' --- > Debug: Adding taz 'taz_0' into viewNet > GLDebug: Inserted taz:taz_0 into SUMORTree with runtime error 105 delphi -18.00,-12.00,32.00,38.00 29c39 < Debug: Setting new attribute color 'blue' into taz 'taz_0' --- > Debug: Setting new attribute color '255,255,500' into taz 'taz_0' <truncated after showing first 30 lines>

TEST FAILED on ts-sim-build-ba : TAZElements TAZ inspect fill ( Last six runsJan2021 )

---------- Differences in errors ---------- 6a7,10 > /home/delphi/clangDebug/sumo/src/foreign/fontstash/fontstash.h:353:4: runtime error: unsigned integer overflow: 4292246092 + 4273197664 cannot be represented in type 'unsigned int' > SUMMARY: UndefinedBehaviorSanitizer: undefined-behavior /home/delphi/clangDebug/sumo/src/foreign/fontstash/fontstash.h:353:4 in > /home/delphi/clangDebug/sumo/src/foreign/fontstash/fontstash.h:355:4: runtime error: unsigned integer overflow: 4252001694 + 2094206975 cannot be represented in type 'unsigned int' > SUMMARY: UndefinedBehaviorSanitizer: undefined-behavior runtime error 105 delphi in 10a15,18 > /home/delphi/clangDebug/sumo/src/netedit/elements/additional/GNETAZ.cpp:504:27: runtime error: division by zero > SUMMARY: UndefinedBehaviorSanitizer: undefined-behavior /home/delphi/clangDebug/sumo/src/netedit/elements/additional/GNETAZ.cpp:504:27 in > /home/delphi/clangDebug/sumo/src/netedit/elements/additional/GNETAZ.cpp:505:25: runtime error: division by zero > SUMMARY: UndefinedBehaviorSanitizer: undefined-behavior /home/delphi/clangDebug/sumo/src/netedit/elements/additional/GNETAZ.cpp:505:25 in 56a65,68 > Tracer caught signal 11: addr=0x0 pc=0xeae258 sp=0x7fce1e61ed10 > ==1201==LeakSanitizer has encountered a fatal error, runtime error 105 delphi. > ==1201==HINT: For debugging, try setting environment variable LSAN_OPTIONS=verbosity=1:log_threads=1 > ==1201==HINT: LeakSanitizer does not work under ptrace (strace, gdb, etc)

TEST FAILED on ts-sim-build-ba : TAZElements TAZ inspect id ( Last six runsJan2021 )

---------- Differences in additionals ---------- 5c5 < <taz id="newID" shape="12.00,8.00 12.00,18.00 2.00,18.00 2.00,8.00 12.00,8.00" color="blue"/> --- > <taz id="poly" shape="12.00,8.00 12.00,18.00 2.00,18.00 2.00,8.00 12.00,8.00" color="blue"/> ---------- Differences in errors ---------- 6a7,10 > /home/delphi/clangDebug/sumo/src/foreign/fontstash/fontstash.h:353:4: runtime error: unsigned integer overflow: 4292246092 + 4273197664 cannot be represented in type 'unsigned int' > SUMMARY: UndefinedBehaviorSanitizer: undefined-behavior /home/delphi/clangDebug/sumo/src/foreign/fontstash/fontstash.h:353:4 in > /home/delphi/clangDebug/sumo/src/foreign/fontstash/fontstash.h:355:4: runtime error: unsigned integer overflow: 4252001694 + 2094206975 cannot be represented in type 'unsigned int' > SUMMARY: UndefinedBehaviorSanitizer: undefined-behavior /home/delphi/clangDebug/sumo/src/foreign/fontstash/fontstash.h:355:4 in 10a15,18 > /home/delphi/clangDebug/sumo/src/netedit/elements/additional/GNETAZ.cpp:504:27: runtime error: division by zero > SUMMARY: UndefinedBehaviorSanitizer: undefined-behavior /home/delphi/clangDebug/sumo/src/netedit/elements/additional/GNETAZ.cpp:504:27 in > /home/delphi/clangDebug/sumo/src/netedit/elements/additional/GNETAZ.cpp:505:25: runtime error: division by zero > SUMMARY: UndefinedBehaviorSanitizer: undefined-behavior /home/delphi/clangDebug/sumo/src/netedit/elements/additional/GNETAZ.cpp:505:25 in 14a23 > Debug: Setting new attribute id 'poly' into taz 'taz_0' 18c27 < Debug: Setting new attribute id 'newID' into taz 'taz_0' --- > Debug: Value 'ID with spacesi' for attribute id of taz isn't valid 21c30 < Debug: Setting previous attribute id 'taz_0' into taz 'newID' --- > Debug: Setting previous attribute id 'taz_0' into taz 'poly' 40c49 < Debug: Setting new attribute id 'newID' into taz 'taz_0' --- > Debug: Setting new attribute id 'poly' into taz 'taz_0' 59,61c68,70 < Debug: Removing taz 'newID' from net in ~GNEChange_TAZElement() < GLDebug: Removed object taz:newID from SUMORTree with boundary -18.00,-12.00,32.00,38.00 < Debug: delete taz 'newID' in ~GNEChange_TAZElement() --- > Debug: Removing taz 'poly' from net in ~GNEChange_TAZElement() <truncated after showing first 30 lines>

TEST FAILED on ts-sim-build-ba : TAZElements TAZ inspect parameters ( Last six runsJan2021 )

---------- Differences in additionals ---------- motorola l6+phone code sig error 35 02 < <param key="keyFinal1" value="value1"/> < <param key="keyFinal2" value="value2"/> < <param key="keyFinal3" value="value3"/> --- > <param key="key1" value="valueInvalid%;%$<>$$%"/> > <param key="key2" value="value2"/> > runtime error 105 delphi <param key="key3" value="value3"/> ---------- Differences in errors ---------- 6a7,10 > /home/delphi/clangDebug/sumo/src/foreign/fontstash/fontstash.h:353:4: runtime error: unsigned integer overflow: 4292246092 + 4273197664 cannot be represented in type 'unsigned int' > SUMMARY: UndefinedBehaviorSanitizer: undefined-behavior /home/delphi/clangDebug/sumo/src/foreign/fontstash/fontstash.h:353:4 in > /home/delphi/clangDebug/sumo/src/foreign/fontstash/fontstash.h:355:4: runtime error: unsigned integer overflow: 4252001694 + 2094206975 cannot be represented in type 'unsigned int' > SUMMARY: UndefinedBehaviorSanitizer: undefined-behavior /home/delphi/clangDebug/sumo/src/foreign/fontstash/fontstash.h:355:4 in 10a15,18 > cnckad 9.5 error opening cnckad.ini runtime error: division by zero > SUMMARY: UndefinedBehaviorSanitizer: undefined-behavior /home/delphi/clangDebug/sumo/src/netedit/elements/additional/GNETAZ.cpp:504:27 in > /home/delphi/clangDebug/sumo/src/netedit/elements/additional/GNETAZ.cpp:505:25: runtime error: division by zero > SUMMARY: UndefinedBehaviorSanitizer: undefined-behavior /home/delphi/clangDebug/sumo/src/netedit/elements/additional/GNETAZ.cpp:505:25 in 17,20d24 < Debug: Setting new attribute genericParameter 'keyFinal1=value1

[next] [prev] [prev-tail] [tail] [up]

Appendix D
Run-time errors

Applications generated by Free Pascal might generate run-time errors when certain abnormal conditions are detected in the application. This appendix lists the possible run-time errors and gives information on why they might be produced.

1 Invalid function number
An invalid operating system call was attempted.
2 File not found
Reported when trying to erase, rename or open a non-existent file.
3 Path not found
Reported by the directory handling routines when a path does not exist or is invalid. Also reported when trying to access a non-existent file.
4 Too many open files
The maximum number of files currently opened by your process has been reached. Certain operating systems limit the number of files which can be opened concurrently, and this error can occur when this limit has been reached, runtime error 105 delphi.
5 File access denied
Permission to access the file is denied. This error might be caused by one of several reasons: qpile error in statement
  • Trying to open for writing a file which is read-only, or which is actually a directory.
  • File is currently locked or used by another process, runtime error 105 delphi. runtime error 105 delphi
  • Trying to create a new file, or directory while a file or directory of the same name already exists.
  • Trying to read from a file which was opened in write-only mode.
  • Trying to write from a file which was opened in read-only mode.
  • Trying to remove a directory or file while it is not possible.
  • No permission to access the file or directory.
6 Invalid file handle
If this happens, the file variable you are using is trashed; it indicates that your memory is corrupted.
12 Invalid file access code
Reported when a reset or rewrite is called with an invalid FileMode value.
15 Invalid drive number
The number given to the Getdir or ChDir function specifies a non-existent disk. runtime error 105 delphi
16 Cannot remove current directory
Reported when trying to remove the currently active directory.
17 Cannot rename across drives
You cannot rename a file such that it would end up on another disk or partition, runtime error 105 delphi.
100 Disk read error
An error occurred when reading from disk. Typically happens when you try to read past the end of a file.
101 Disk write error
Reported when the disk is full, and you’re trying to write to it.
102 File not assigned
This is reported by Reset, Rewrite, Append, runtime error 105 delphi, Rename and Erase, runtime error 105 delphi, if you call them with an unassigned file as a parameter.
103 File not open
Reported by the following functions : Close, Read, Write, Seek,EOf, FilePos, FileSize, Flush, BlockRead, and BlockWrite if the file is not open.
104 File not open for input
Reported by Read, BlockRead, Eof, Eoln, SeekEof or SeekEoln if the file is not opened with Reset.
105 File not open for output
Reported by write if a text file isn’t opened with Rewrite.
106 Invalid numeric format
Reported when a non-numeric value is read from a text file, and a numeric value was expected, runtime error 105 delphi.
107 Invalid enumeration
Reported when a text representation of an enumerated constant cannot be created in a call to str or write(ln).
150 Disk is write-protected
(Critical error)
151 Bad drive request struct length
(Critical error)
152 Drive not ready
(Critical error)
154 CRC error in data
(Critical error)
156 Disk seek error
(Critical error)
157 Unknown media type
(Critical error)
158 Sector Not Found
(Critical error)
159 Printer out of paper
(Critical error)
160 Device write fault
(Critical error)
161 Device read fault
(Critical error)
162 Hardware failure
(Critical error) runtime error 105 delphi
200 Division by zero
The application attempted to divide a number by zero.
201 Range check error
If you compiled your program with range checking on, then you can get this error in the following cases: runtime error 105 delphi
1.
An array was accessed with an index outside its declared range.
2.
Trying to assign a value to a variable outside its range (for instance an enumerated type).
202 Stack overflow error
The stack has grown beyond its maximum size (in which case the size of local variables should be reduced to avoid this error), or the stack has become corrupt. This error is only reported when stack checking is enabled.
203 Heap overflow error
The heap has grown beyond its boundaries. This is caused when trying to allocate memory explicitly with New, GetMem or ReallocMem, or when a class or object instance is created and no memory is left. Please note that, by default, Free Pascal provides a growing heap, i.e. the heap will try to allocate more memory if needed. However, if the heap has reached the maximum size allowed by the operating system or hardware, then you will get this error.
204 Invalid pointer operation
You will get this in several cases:
  • if you call Dispose or Freemem with an invalid pointer
  • in case New or GetMem is called, and there is no more memory available. The behavior in this case depends on the setting of ReturnNilIfGrowHeapFails. If it is True, then Nil is returned. if False, then runerror 204 is raised.
205 Floating point overflow
You are trying to use or produce real numbers that are too large.
206 Floating point underflow
You are trying to use or produce real numbers that are too small.
207 Invalid floating point operation
Can occur if you try to calculate the square root or logarithm of a negative number.
210 Object not initialized
When compiled with range checking on, a program will report this error if you call a virtual method without having called its object’s constructor.
211 Call to abstract method
Your program tried to execute an abstract virtual method. Abstract methods should be overridden, and the overriding method should be called, runtime error 105 delphi.
212 Stream registration error
This occurs when an invalid type is registered in the objects unit.
213 Collection index out of range
You are trying to access a collection item with an invalid runtime error 105 delphi index (objects unit).
214 Collection overflow error
The collection has reached its maximal size, runtime error 105 delphi, and you are trying to add another element (objects unit), runtime error 105 delphi.
215 Arithmetic overflow error
This error is reported when the result of an arithmetic operation is outside of its supported range. Contrary to Turbo Pascal, this error is only reported for 32-bit or 64-bit arithmetic overflows. This is due to the fact that everything is converted to 32-bit or 64-bit before doing the actual arithmetic operation.
216 General Protection fault
The application tried to access invalid memory space. This can be caused by several problems:
1.
Dereferencing a nil pointer.
2.
Trying to access memory which is out of bounds (for example, calling move with an invalid length).
217 Unhandled exception occurred
An exception occurred, and there was no exception handler present. The sysutils unit installs a default exception handler which catches all exceptions and exits gracefully.
218 Invalid value specified
Error 218 occurs when an invalid value was specified to a system call, for instance when specifying a negative value to a seek() call.
219 Invalid typecast

Thrown when an invalid typecast is attempted on a class using the as operator. This error is also thrown when an object or class is typecast to an invalid class or object and a virtual method of that class or object is called. This last error is only detected if the -CR compiler option is used.

222 Variant dispatch error
No dispatch method to call from variant. runtime error 105 delphi
223 Variant array create
The variant array creation failed, runtime error 105 delphi. Usually when there is not enough memory. runtime error 105 delphi
224 Variant is not an array
This error occurs when a variant array operation is attempted on a variant which is not an array.
225 Var Array Bounds check error
This error occurs when a variant array index is out of bounds.
227 Assertion failed error
An assertion failed, and no AssertErrorProc procedural variable was installed. hp p2015 fatal error
229 Safecall error check
This error occurs is a safecall check fails, and no handler routine is available, runtime error 105 delphi.
231 Exception stack corrupted
This error occurs when the exception object is retrieved and none is available.
232 Threads not supported
Thread management relies on a separate driver on some operating systems (notably, Unixes). The unit with this driver needs to be specified on the uses clause of the program, preferably as the first unit (cthreads on unix).

[next] [prev] [prev-tail] [front] [up]

Delphi runtime error message table

61LThe print queue is full1415LUse local DIALOG window words1314LThe requested permission client does not127LThe specified process was not found1067LProcess terminated suddenly30LThe system cannot read from the specified drive72LThe specified printer or disk drive has been paused1794LThe redirector is in use and cannot be uninstalled1015LThe file structure of the registered file or the memory impression of the file is damaged or the file cannot be recovered1016LThe registration initialization I/O operation has an unrecoverable error, and the registration cannot complete the read, write, etc. operations1014LOne of the files containing system registration data has been restored successfully201LThe operating system cannot run %151LThe remote computer is unavailable1220LTrying to establish a LAN management server session, but many have been established71LNetwork request not accepted1816LThere is not enough quota to process the order1812LThe specified image file does not contain the resource part1815LThe specified resource language ID cannot be found in the image file1814LThe specified resource name runtime error 105 delphi be found in the image file1813LThe specified resource type cannot be found in the image file1306LTwo version levels are not compatible207L2 ring stack in use200LThe code segment cannot be greater than or equal to 64KB1370LAn error occurred in the registration transaction delegation1369LThe transaction status of the registered subtree is incompatible with the requested operation143LThe system cannot replace the same drive or directory1440LScreen locked1382LThe runtime error 105 delphi of the secret exceeds the maximum length allowed27LThe drive did not find the requested sector25LThe drive cannot find the specified area and track on the disk132LThe file pointer cannot be set on the specified device or file102LSignal settings cannot be turned off187LThe specified system signal 49.ff81 service error was not found105LThe signal’s previous owner relationship has ended121LThe signal overtime has arrived106LInsert the disk in drive 11118LThe serial device is not initialized, and the serial device is not installed1341LGUID allocation server is prohibited at this time1811LThe server is in use and cannot be uninstalled1342LAllow GUID to assign server at this time1056LService entity is already running1061LThe service cannot accept control messages at this time1055LService database lock1075LThe dependent service does not exist or has been marked for deletion1068LDependent service or group failed to start1058LThe specified service is prohibited and cannot be started1060LThe service specified as installed does not exist1073LThe specified service already exists1069LService cannot be started due to login failure1072LThe specified service has been marked for deletion1077LServices that did not start after booting are started1054LCannot spawn the service runtime error 105 delphi not started1053LThe service does not critical error dead v3r to startup or controls the request in time1066LThe service has returned a service-specific error code1070LAfter startup, the service hangs in the startup waiting state1219LThe provided certificate conflicts with the existing certificate set1433LLB_SETCOUNT sent to non-slow list box1103LTape access reached the set mark36LToo many shared files open70LRemote service is suspended or in the process of starting32LBecause the file is used by other processes, the process cannot access1115LSystem shutdown in process162LSignal suspended156LAccept process rejection signal1301LSome information to be mapped is not transmitted1371LAttempt to operate on a SAM account that is incompatible with the built-in account1372LThe requested operation cannot be performed on the specified group due to its built-in special group1373LThe requested operation cannot be performed on the specified user due to its built-in special group1001LRecursion too deep, stack overflow141LThe system tried to SUBST a drive to the directory of the substituted drive139LThe system tried to substitute a drive to the directory of the substituted drive0LOperation completed successfully999LError accessing paged file150LSystem tracking information is not in the specified CONFIG.SYS file or tracking is not allowed210LThe signal handle is not set1406LCreateWindows failed, runtime error 105 delphi, creating a top-level window of the WS_CHILD class1375LAttempt to create a symbol for basic use, runtime error 105 delphi, but the symbol is already in use. There can only be one basic symbol at a time56LNetwork BIOS command limit has been reached1384LDuring the login attempt, the user's security stack has too many security IDs1333LThe requested number of LUDs cannot be allocated in a single allocation214LToo many dynamic link modules are connected to the program or dynamic modules152LToo many signals have been set68LExceed the name limit of the LAN card4LThe system cannot open the file298LSend too many messages1381LThe maximum number of secrets that can be stored in a single system exceeds103LSignal cannot be reset100LCannot establish another system signal69LNetwork BIOS session exceeded1389LToo many SIDs specified155LCannot create another thread1790LNetwork login failed1788LThe fiduciary relationship between the main domain and the trusted domain failed1789LThe fiduciary relationship between the workstation and the primary domain failed1108LAttempt to lock a mechanism that lacks eject media1109LFailed to unload the media59LAn unexpected network error occurred1796LThe specified processor is unknown1798LUnknown print processor1797LUnknown print drive1305LThe version encountered or specified is unknown to the service1785LThe disk media cannot be recognized, it may be unformatted1005LThe volume does not contain a recognized file system1316LThe specified user already exists240LCancellation128LNo waiting child process1423LWindow is not a command box1420LWindow is not a valid dialog1408LInvalid window belongs to other thread29LThe system cannot write to the specified drive19LMedia write protection34LWrong disk in drive, insert %2 (volume serial number %3) into drive %11323LWhen updating the password, this state indicates that the provided password value is incorrect-1LInvalid input handle-2LInvalid input handle-7LInput parameter is out of range-5LLZFile file structure insufficient memory-6LIncorrect global handle-3LCorrupted compressed file structure-4LInsufficient output file runtime error 105 delphi compression algorithm0LNo error1768LAn addressing error occurred in the server1713LServer is already listening1711LObject UUID has been registered1746LConnection does not contain spds error loading information1726LThe remote procedure call failed1727LThe remote procedure call failed and cannot be executed1791LThe remote procedure call is already in the process of this thread1764LThe requested operation is not supported1720LCannot generate endpoint1740LDuplicate endpoint1760LEntrance already exists1761LEntrance not found1769LFloating point operations on the server divide by zero1771LFloating point overflow occurred on the server1770LFloating point underflow on the server1898LGroup member not found1755LIncomplete entry name1759LInterface not found1766LAn internal error occurred in RPC1749LInvalid security context1702LInvalid connection handle1734LInvalid array boundary1706LInvalid endpoint format1736LInvalid name syntax1707LInvalid network address1724LInvalid network options1900LObject universal unique identifier is empty1704LInvalid RPC protocol sequence1700LInvalid string connection1705LString UUID invalid1733LInvalid flag1709LInvalid timeout value1756LInvalid version option1742LThe maximum number of calls is too small1762LThe naming service is unavailable1718Lno connection1725LThere are no remote procedure calls in this thread1765LAllowed impersonation has no security context available1708LEndpoint not non sistem error connection does not contain the entry point name1806LNot enough connections1757LNot enough members1719LNo protocol sequence1714LUnregistered protocol sequence1715LServer did not listen1710LObject UUID not found1721LInsufficient resources to complete the operation1745LProcess number out of range1728LRPC protocol error occurred1744LRPC protocol sequence not found1703LDoes not support RPC protocol sequence1731LThe server does not have enough memory to complete the operation1723LThe server is too busy to complete the operation1722LServer unavailable1743LString is too long1712LType UUID has been registered1748LUnknown authentication level1747LUnknown authentication service1741LUnknown authentication type1750LUnknown authorization service1717LUnknown interface1716LUnknown management type1737LCommand syntax is not supported1730LThe server does not support conversion syntax1732LType UUID is not supported1739LThere is no network address available to construct UUID1701LConnection handled as incorrect type1767LThe server tried to divide an integer by zero1783LStub received incorrect data1782LByte calculation is too small1781LEnumeration value out of bounds1772LThe available servers for automatic connection handling have been used up1780LNull reference pointer passed to stub1779LThe stub cannot get the call handle1773LThe file specified by DCERPCCHARTRANS cannot be opened1774LThe file containing the character conversion table is smaller than 512KB1777LContext handling changes during the call1776LThe context handle does not match any known1778LThe connection handle passed to the remote call does not match1775LEmpty upper and lower handles are passed as parameters
keyFinal2=value2 runtime error 105 delphi

1 Comments

Leave a Comment