Nameerror at / django

nameerror at / django

code.djangoproject.com › ticket. With Python 3.7.9 and Django 3, the application always fails with the error “NameError: name '_mysql' is not defined”. Django Version: 2.2. Exception Type: NameError. Exception Value: name 'redirect' is not defined. Exception Location: E:\Django_Try\bot4\bot3\saeed\views.py.

watch the thematic video

How to Django : Python NameError: name 'include' is not defined

what is the meaning of nameerror at / django error

Saeed Pooladzadeh's profile photo

Saeed Pooladzadeh

unread,
May 28, 2019, nameerror at / django, 3:49:25 AM5/28/19

Reply to author

Sign in to reply to author

Forward

Sign in to forward

Delete

You do not have permission to delete messages in this group

Link

Report message as abuse

Sign in to report message as abuse

Show original message

Either email addresses are anonymous for this group or you need the view member nameerror at / django addresses permission to view the original message

to Django users

hello

Can you please help me to understand the meaning of this error:


 Is it mean Django cant understand the meaning of redirect??

But I have used redirect on my other project?

“NameError: name 'django' is not defined” Code Answer

Grepper Logo



app = Flask(_name_) NameError: name '_name_' is not defined


Answers related to “NameError: name 'django' is not defined”


Queries related to “NameError: name 'django' is not defined”




Browse Python Answers by Framework


More “Kinda” Related Answers View All Python Answers »

  • TypeError: argument of type 'WindowsPath' is not iterable
  • TypeError: argument of type 'LazyCorpusLoader' is not iterable
  • 'django-admin' is not recognized as an internal or external command,
  • install reportlab python
  • Import "reportlab.pdfgen.canvas" could not be resolved
  • ModuleNotFoundError: No module named 'reportlab'
  • Import "reportlab" could not be resolved django
  • raise ImproperlyConfigured( django.core.exceptions.ImproperlyConfigured: WSGI application 'yorc_api.wsgi.application' could not be loaded; Error importing module.
  • ImportError: cannot import name 'ugettext_lazy' from 'django.utils.translation
  • NameError: name 'accuracy_score' is not defined
  • python name 'List' is not defined
  • name 'requests' is not defined python
  • NameError: name 'plot_model' is not defined
  • DeprecationWarning: executable_path has been deprecated, please pass in error 99 canon Service object
  • executable_path has been deprecated, please pass in a Service object driver = webdriver.Chrome(ChromeDriverManager().install())
  • webdriver.Chrome
  • YAMLLoadWarning: calling yaml.load() without Loader=. is deprecated, as the default Loader is unsafe. Please read https://msg.pyyaml.org/load for full details.
  • NameError: name 'StringIO' is not defined
  • NameError: name 'TimeDistributed' is not defined
  • get_object_or_404
  • get_object_or_404 django
  • NameError: name 'timedelta' is not defined
  • ImportError: cannot import name 'force_text' from 'django.utils.encoding'
  • NameError: name 'base64' is not defined
  • mysql config not found
  • your account has reached its concurrent builds limit
  • ImportError: cannot import name 'clock' from 'time' (unknown location)
  • dirs' base_dir / 'templates' error
  • django raise 404
  • Import "django.core.urlresolvers" could not be resolved
  • server error 500 heroku django
  • urllib.error.HTTPError: HTTP Error 403: Forbidden
  • how to fix turtle has no member
  • module turtle has no forward member
  • security/no-block-members: Avoid using 'block.timestamp'.
  • error popup in nameerror at / django not visible
  • 'polls' is not a registered namespace
  • SSL handshake failed: localhost:27017
  • you are trying to access thru https but only allows http django
  • widget_tweaks' is not a registered tag library. must be one of
  • django.core.exceptions.ImproperlyConfigured: WSGI application 'souroSANOU.wsgi.application' could not be loaded; Error importing module.
  • error 401 unauthorized "Authentication credentials were not provided."
  • views.home not found django
  • 'django' is not recognized as an internal or external command
  • ?: (corsheaders.E013) Origin '.' in CORS_ORIGIN_WHITELIST is missing scheme or netloc HINT: Add a scheme (e.g. https://) or netloc (e.g, nameerror at / django. example.com).
  • The authorization mechanism you have provided is not supported. Please use AWS4-HMAC-SHA256
  • forbidden (csrf cookie not set.) django rest framework
  • Could not locate a bind configured on mapper mapped class class->tablename, SQL expression nameerror at / django this Session.
  • you are not allowed to access 'Unknown' (_unknown) records "odoo"
  • 1052 uri solution
  • port 5432 failed: timeout expired
  • connection to server at "" (), port 5432 failed: timeout expired
  • redirected but the response is missing a location: header.
  • port 5432 failed: Connection timed out (0x0000274C/10060) Is the server running on that host and accepting TCP/IP connections?
  • NameError: name ‘pd’ is not defined
  • NameError: name 'request' is not defined
  • NameError: name 'after_this_request' is not defined
  • 'randint' is not defined
  • STATIC_ROOT = os.path.join(BASE_DIR, 'static') NameError: name 'os' is not defined
  • NameError: name 'optim' is not defined
  • reload is not defined python 3
  • 'set' object is not error a2008 db error in conda
  • name 'Pipeline' is not defined
  • no 'access-control-allow-origin' header is present on the requested resource GraphQL Django
  • django has been blocked by CORS policy: Response to preflight request doesn't pass access control check: No 'Access-Control-Allow-Origin' header is present on the requested resource.
  • django.core.exceptions.ImproperlyConfigured
  • selenium.common.exceptions.ElementNotInteractableException: Message: element not interactable
  • name 'BytesIO' is not defined
  • django post request 403 forbidden
  • 'flask' is not recognized as an internal or external command, operable program or batch file.
  • django database connection isn't set to UTC postgresql
  • name 'glob' is not defined
  • import python glob module
  • NameError: name 'views' is not defined
  • django get or 404
  • noninspection access to protected member
  • how to 404 custom page not found in django
  • heroku login ip address mismatch
  • tkmessagebox not found
  • IntegrityError
  • IntegrityError import in django
  • You must either define the environment variable DJANGO_SETTINGS_MODULE or call settings.configure() before accessing settings.
  • app = Flask(_name_) NameError: name '_name_' is not defined
  • how to custom page not found in django
  • import get_object_or_404
  • import get object
  • Module "django.contrib.auth.hashers" does not define a "BcryptPasswordHasher" attribute/class
  • django.db.utils.ProgrammingError: relation "users" does not exist in django 3.0
  • django.core.exceptions.FieldError: 'date' cannot be specified for Forum model form as it is a non-editable field
  • not null constraint failed django
  • at=error code=H10 desc="App crashed" django
  • app is not a registered namespace django
  • Origin in CORS_ORIGIN_WHITELIST is missing scheme or netloc
  • CSRF verification failed. Request aborted.
  • res.send is not a function
  • django.core.exceptions.ImproperlyConfigured: Application labels aren't unique, duplicates: auth
  • form data postman don't work
  • get current domain name django
  • domain name of my site
  • NameError: name 'reduce' is not defined
  • NameError: name 'transforms' is not defined site:stackoverflow.com
  • Invalid HTTP_HOST header: 'dtodo2.herokuapp.com'. You may need to add 'dtodo2.herokuapp.com' to ALLOWED_HOSTS.
  • TypeError: Direct error reading s.m.a.r.t to the forward nameerror at / django of a many-to-many set is prohibited. Use .set() instead
  • BaseSSHTunnelForwarderError: Could not establish session to SSH gateway
  • nameerror name 'defaultdict' is not defined
  • gaierror at /members/register [Errno 11001] getaddrinfo failed
  • ImportError: cannot import name 'Request' from 'urllib2' (unknown location)
  • Reason: Worker failed to boot
  • heroku[web.1]: Process exited with status 3
  • address already in use
  • urllib.error.HTTPError: HTTP Error 404: Not Found
  • django.core.exceptions.ImproperlyConfigured: The SECRET_KEY setting must not be empty.
  • "default_dburl" is not defined Pylance
  • Forbidden (CSRF token missing or incorrect.): /extension/stripe-pay/ WARNING 2021-06-01 13:45:22,532 log 408 140165573588736 Forbidden (CSRF token missing or incorrect.): /extension/stripe-pay/
  • remote origin already exists git error
  • telethon says telethon.errors.common.MultiError: ([FloodWaitError('A wait of 27 seconds is required (caused by GetParticipantsRequest)'), None, None, nameerror at / django, FloodWaitError('A wait of 27 seconds )
  • Import "sendgrid" could not be resolved django
  • azure.core.exceptions.ServiceResponseError: ('Connection aborted.', timeout('The write operation timed out'))
  • no exception message supplied django template
  • on_member_join not working
  • [ WARN:0] global C:\Users\appveyor\AppData\Local\Temp\1\pip-req-build-wwma2wne\o pencv\modules\videoio\src\cap_msmf.cpp (677) CvCapture_MSMF::initStream Failed t o set mediaType (stream 0, (640x480 @ 30) MFVideoFormat_RGB24(codec not found)
  • 'jet' is not a registered namespace
  • django.db.utils.IntegrityError:
  • bad request 400 heroku app
  • The MEDIA_URL setting must end with a slash.
  • avoid bad request django
  • admin page Bad Request (400) django
  • Access to XMLHttpRequest has been blocked by CORS policy: Response to preflight request doesn't pass access control check: No 'Access-Control-Allow-Origin' header is present on the requested resource django
  • django csrf failed
  • python NameError: name 'io' is not defined
  • sqlalchemy integrityerror
  • WARNING: Retrying (Retry(total=4, connect=None, read=None, redirect=None, status=None)) after connection broken by 'ReadTimeoutError("HTTPSConnectionPool(host='pypi.org', port=443):
  • webdriver firefox install
  • PermissionError: [Errno 13] Permission denied on flask
  • TypeError: create_superuser() missing 1 required positional argument:
  • 'djdt' is not a registered namespace
  • TypeError: Register() missing 1 required positional argument: 'request'
  • The module in NAME could not be imported: django.contrhtmlib.auth.password_validation.UserAttributeSimilarityValidator. Check your AUTH_PASSWORD_VALIDATORS setting.
  • 405 Method Not Allowed When Redirecting in Flask within POST route
  • aiohttp.client_exceptions.ClientConnectorCertificateError
  • ValueError: Please provide a TPU Name to connect to. site:stackoverflow.com
  • include" is not definedP
  • Console code page (437) differs from Windows code page (1252) 8-bit characters might not work correctly
  • allowed_hosts error ecs django
  • NameError: name 'CAP_PROP_FPS' is not defined
  • self.tk.call( _tkinter.TclError: unknown option "-relwdth"
  • django error displaying images page not found
  • 1043 uri solution
  • 1047 uri solution
  • "detail": "Method \"POST\" not allowed." django
  • 52277-36880
  • django.db.utils.ProgrammingError: (1146
  • create_user() missing 1 required positional argument: 'username'
  • 1041 uri solution
  • django BruteBuster error failed attempts
  • flask_uploads.exceptions.UploadNotAllowed
  • re_path(r'^logout/$',views.logout, nameerror at / django, {"next_page":'/'},name="logout"), AttributeError: module 'django.contrib.auth.views' has no attribute 'logout'
  • raise httperror(req.full_url, code, msg, hdrs, fp) urllib.error.httperror: http error 429: too many requests
  • Resource stopwords not found
  • global variable not accessible withing thread
  • Express + Jade : Ensuring url paths are correct via controllers, orphaned links
  • django error column last_login cannot be null
  • dataproc initialization_actions error
  • pyttsx3 NameError: name 'voices' is not defined
  • Not getting values from Select Fields with jQuery
  • code suggestion html not working in django-html
  • \django\apps\config.py", line 247, in create raise ImproperlyConfigured( django.core.exceptions.ImproperlyConfigured: Cannot import 'core'. Check that 'apps.core.apps.CoreConfig.name' is correct.
  • "action" is not defined django
  • Asn1 parsing error when trying to connect to mongo atlas
  • ./bootstrap command not found in dockerfile
  • Redirect to the same page and display a message if user insert wrong data
  • TypeError: can't pickle weakref objects site:stackoverflow.com
  • make_response is not defined django
  • axios post to django rest return fobidden 403
  • Permission error
  • NameError: name 'MEDIA_URL' is not defined
  • nameerror name '_mysql' is not defined flask
  • python profile is not defined line_profiler
  • 1044 uri solution
  • google.api_core.exceptions.ServiceUnavailable: 503 The datastore operation timed out, or the data was temporarily unavailable when using stream
  • "DjangoJSONEncoder" is not defined
  • 1042 uri solution
  • 1046 uri solution
  • slack bot error not_in_channel
  • W0622: Redefining built-in 'zip' (redefined-builtin)
  • Attempted to load corpora/stopwords
  • django wsgi application could not be loaded error importing module
  • "must be called with either an object pk or a slug in the URLconf"
  • NameError nameerror at / django Traceback (most recent call last) <ipython-input-36-28457fcc3f62> in <module> ----> 1 plt.bar(freqs.index, freqs.values, color = "green") 2 plt.show() NameError: name 'freqs' is not defined
  • django rest swagger error 'staticfiles' is not a registered tag library. Must be one of
  • Flask error: werkzeug.routing.BuildError
  • Backend not found Request Method: GET Request URL: http://127.0.0.1:8000/oauth/login/google-oauth2/ Raised by: social_django.views.au
  • An error occurred while connecting: 10049: The requested address is not valid in its context. scrapy splash
  • name 'typeText' is not defined python
  • HTTP Error 403: Forbidden django account signup email
  • django Mixed Content: The page at '' was loaded over HTTPS, but requested an insecure resource swagger
  • django.db.utils.operationalerror: (1051, "unknown table
  • How to correctly call url_for and specify path parameters
  • django register form return a 302 request
  • (908) 403-8900
  • INSERT INTO via SQLAlchemy/MySQL doesn't work when executed with parameters
  • admin email errors
  • the webpage at http://127.0.0.1:8000/ might be temporarily down or it may have moved permanently to a new web address. django
  • Compute the variance of this RDD’s elements
  • add up all the numbers in each row and output that nameerror at / django output the grand total of all rows
  • idl else
  • python creare una list comprehension
  • random word generator django
  • say hello to someone in python
  • comment arrêter l'exécution d'un programme python
  • convert python to java
  • selenium interview questions 2019
  • bokeh bar chart
  • python range of array
  • export an excel table to image with python
  • how to append variable python
  • how to watermark a video using nameerror at / django i need do some set when i use GPU to nameerror at / django tensorflow model
  • TypeError: can only concatenate str (not "method") to str
  • # get the largest number in a list and print its nameerror at / django training= false still dropout
  • Young C so new(pro.cashmoneyap x nazz music) soundcloud
  • linux pyspark select java version
  • 'utf-8' codec can't decode byte 0x85 in position 715: invalid start byte
  • update tensorflow pip
  • 'pip' is not recognized as an internal or external command, operable program or batch file.
  • UnicodeDecodeError: 'charmap' codec can't decode byte 0x9d in position 6148: character maps to <undefined>
  • error tokenizing data. c error
  • ParserError: Error tokenizing data. C error: Expected 1 fields in line 87, saw 2
  • UnicodeDecodeError: 'utf-8' codec can't decode byte 0xe7 in position 5: invalid continuation byte
  • Flask – Environment
  • install flask on linux mint for python3
  • how to install flask
  • install flask
  • libGLU.so.1: cannot open shared nameerror at / django file: No such file or directory
  • how to print error in try except python
  • ModuleNotFoundError: No module named 'pandas'
  • python open encoding utf-8
  • A value is trying to be set on a copy of a slice from a DataFrame.
  • Message: 'chromedriver' executable needs to be in PATH, nameerror at / django. Please see https://sites.google.com/a/chromium.org/chromedriver/home
  • catch error python
  • django make migrations
  • django.db.utils.OperationalError: no such table:
  • ModuleNotFoundError: No module named 'sklearn'
  • docker compose command not found
  • UnicodeEncodeError: 'charmap' codec can't encode characters in position 6-9: character maps to <undefined>
  • UnicodeDecodeError: 'utf-8' codec can't decode byte invalid start byte
  • pip is not recognized as an internal or external command cmd
  • ModuleNotFoundError: No module named 'matplotlib'
  • ImportError: No module named flask
  • except as exception:
  • geckodriver' executable needs to be in path
  • pip is not recognized as an internal or external command
  • charmap codec can't encode character
  • AttributeError: module 'urllib' has no attribute 'URLopener'
  • no module named cv2
  • ssl.SSLCertVerificationError: [SSL: CERTIFICATE_VERIFY_FAILED] certificate verify failed: unable to get local issuer certificate (_ssl.c:1091)
  • python check namespace has instance
  • check filed exist in object python
  • python check if has attribute
  • AttributeError: module 'tensorflow' last fm socket error 10022 no attribute 'Session'
  • XLRDError: Excel xlsx file; not supported
  • Inconsistent syscall error contacting server of tabs and spaces in indentationPylance
  • python urlencode
  • python catch all exceptions
  • ImportError: Couldn't import Django. Are you sure it's installed and available on your PYTHONPATH environment variable? Did you forget to activate a virtual environment?
  • type object 'datetime.datetime' has no attribute 'timedelta'
  • PackagesNotFoundError: The following packages are not available from current channels: - python==3.6
  • UnicodeDecodeError: 'utf-8' codec can't decode byte 0xb0 in position 1968: invalid start byte
  • AttributeError: module 'tensorflow' has no attribute 'GraphDef'
  • vscode not recognizing python import
  • ValueError: logits and labels must have the same shape ((None, 1) vs (None, 2))
  • ModuleNotFoundError: No module named 'MySQLdb' in windows
  • Exception: 'ascii' codec can't decode byte 0xe2 in position 7860: ordinal not in range(128)
  • AttributeError: module 'tensorflow' has no attribute 'placeholder'
  • TypeError: sequence item 0: expected str instance, int found
  • ParserError: Error tokenizing data. C error: Expected 1 fields in line 6, saw 3
  • python utf8
  • cors error in flask
  • UnicodeDecodeError: 'charmap' codec can't decode byte 0x81 in position 92: character maps to <undefined>
  • utf-8 codec can't decode byte python
  • cv2 not found
  • SSL: CERTIFICATE_VERIFY_FAILED with Python3
  • streamlit ssl error
  • urllib.error.URLError: <urlopen error [SSL: CERTIFICATE_VERIFY_FAILED] certificate verify failed: unable to get local issuer certificate (_ssl.c:1123)>
  • 'str' object has no attribute 'read'
  • how to install cuda in anaconda
  • install mysql.connector
  • regex to validate email
  • module 'datetime' has no attribute 'strptime'
  • ImportError: No module named _tkinter, please install the python-tk package
  • interface graphique sur python
  • OS Error: Connection refused, errno = 111, address = 127.0.0.1, port = 43350
  • cannot import name 'patterns' from 'django.conf.urls'
  • from django.conf.urls import url ImportError: cannot import name 'url' from 'django.conf.urls'
  • force utf-8 encoding python
  • ModuleNotFoundError: No module named 'sklearn.cross_validation'
  • Error: Could not locate a Flask application. You did not provide nameerror at / django "FLASK_APP" environment variable, and a "wsgi.py" or "app.py" module was not found in the current directory.
  • max heap python
  • TypeError: cannot unpack non-iterable int object
  • ImportError: No module named requests
  • return codecs.charmap_decode(input,self.errors,decoding_table)[0] UnicodeDecodeError: 'charmap' codec can't decode byte 0x8d in position 280: character maps to <undefined>
  • npm ERR! gyp ERR! stack Error: Can't find Python executable "python", you can set the PYTHON env variable.
  • gyp ERR! find Python
  • cannot import name 'joblib' from 'sklearn.externals'
  • ImportError: cannot import name 'joblib' from 'sklearn.externals' (C:\Users\Maaz Bin Ahmed\anaconda3\lib\site-packages\sklearn\externals\__init__.py)
  • no module named torch
  • install pytorch
  • AttributeError: 'dict' object has no attribute 'iteritems'
  • install python decouple
  • Import "decouple" could not be resolved Pylance
  • python decouple
  • how to install terminal in atom
  • python download for ubuntu 20.04
  • UnicodeDecodeError: 'charmap' codec can't decode byte 0x9e in position 3359: character maps to <undefined>
  • python except error as e
  • python not null
  • rest_framework_simplejwt
  • pip install djangorestframework-simplejwt
  • No module named 'rest_framework_simplejwt'
  • 'Sequential' object has no attribute 'predict_classes'
  • confusion matrix error solution
  • Can't find model 'en_core_web_sm'
  • OSError: [E050] Can't find model 'de'. It doesn't seem to be a shortcut link, a Python package or a valid path to a data directory.
  • spacy en_core_web_sm error
  • AttributeError: module 'tensorflow' has no attribute 'Session' site:stackoverflow.com
  • how to import reverse
  • No module named 'django.core.urlresolvers'
  • ModuleNotFoundError: No module named 'django.core.urlresolvers'
  • ModuleNotFoundError: No module named 'Crypto'
  • Couldn't find a tree builder with the features you requested: lxml. Do you need to install a parser library?
  • E: Unable to locate package python3-pip
  • conda install xgboost
  • No module named 'xgboost'
  • No matching distribution found for tensorflow==2.2.0
  • winerror 5 access is denied pip
  • python class name
  • python json dump utf8
  • remove warnings from jupter notebook
  • suppress warning jupyter notebook
  • from distutils.util import strtobool ModuleNotFoundError: No module named 'distutils.util'
  • E: Nameerror at / django not get lock /var/lib/dpkg/lock-frontend - open (11: Resource temporarily unavailable)
  • Can't find model 'en_core_web_sm'. It doesn't seem to be a shortcut link, a Python package or a valid path to a data directory.
  • module 'tensorflow' has no attribute 'Session'
  • from _curses import * ModuleNotFoundError: No module named '_curses'
  • AttributeError: module 'datetime' has no attribute 'now'
  • python Non-UTF-8 code starting with
  • AttributeError: module 'cv2' has no attribute 'imread'
  • no module named pyplot
  • from Crypto.Cipher import AES ModuleNotFoundError: No module named 'Crypto'
  • fix ImportError: No module named PIL
  • unable to get local issuer certificate python
  • ModuleNotFoundError: No module named 'numpy'
  • ImportError: Couldn
  • ImportError: No module named pandas
  • 'str' object has no attribute 'strftime'
  • cant install tensorflow pip python 3.6
  • for e in p.event.get(): pygame.error: video system not initialized
  • OSError: [E050] Can't find nameerror at / django 'en'. It doesn't seem to be a shortcut link, a Python package or a valid path to a data directory.
  • ModuleNotFoundError: No module named 'scipy'
  • ModuleNotFoundError: Nameerror at / django module named 'seaborn'
  • how to install flask module in vscode
  • django no such table
  • python with statement file does not exist exception
  • ModuleNotFoundError: No module named 'Cython'
  • mac install pip
  • install python 3.6 ubuntu 16.04
  • python cv2.Canny()
  • ModuleNotFoundError: No module named 'decouple'
  • read json in python
  • read json file using python
  • mac os selenium.common.exceptions.WebDriverException: Message: 'chromedriver' executable needs to be in PATH. Please see https://chromedriver.chromium.org/home
  • AttributeError: module 'django.contrib.auth.views' has no attribute 'login'
  • io.UnsupportedOperation: not readable
  • json not readable python
  • TabError: inconsistent use of tabs and spaces in indentation
  • cannot import name 'SGD' from 'keras.optimizers'
  • ImportError: cannot import name 'SGD' from 'keras.optimizers' (/usr/local/lib/python3.7/dist-packages/keras/optimizers.py) site:stackoverflow.com
  • import sgd from keras.optimizers
  • No default language could be detected for django app
  • module 'tensorflow' has no attribute 'reset_default_graph'
  • error urllib request no attribute
  • UnicodeEncodeError: 'latin-1' codec can't encode character '\u2013' in position 83: ordinal not in range(256)
  • ModuleNotFoundError: No module named 'slugify'
  • slugify python
  • ERROR: Could not install packages due to an OSError: [WinError 2] The system cannot find the file specified: 'C:\\Python310\\Scripts\\normalizer.exe' -> 'C:\\Python310\\Scripts\\normalizer.exe.deleteme'
  • ImportError: DLL load failed while importing win32api: The specified procedure could not be found.
  • ImportError: DLL load failed while importing win32file: The specified module could not be found.
  • USB: usb_device_handle_win.cc:1049 Failed to read descriptor from node connection: A device attached to the system is not functioning. (0x1F)
  • 'Keras requires TensorFlow 2.2 or higher. ' ImportError: Keras requires TensorFlow 2.2 or higher. Install TensorFlow via `pip install tensorflow
  • pyodbc sql server connection string
  • No module named 'PyQt5.QtWebEngineWidgets'
  • pip install mysqldb
  • how to manipulate audio in python
  • ModuleNotFoundError: No module named 'pydub'
  • OSError: [Errno 98] Address already in use
  • flask cors policy no 'access-control-allow-origin'
  • ImportError: cannot import name 'Adam' from 'keras.optimizers' (/usr/local/lib/python3.7/dist-packages/keras/optimizers.py) site:stackoverflow.com
  • pyaudio not installing ubuntu
  • python 3.9 ModuleNotFoundError: No module named 'distutils.sysconfig'
  • ModuleNotFoundError: No module named 'selenium'
  • name 'plt' is not defined
  • No module named 'sklearn.cross_validation'
  • python UnicodeEncodeError: 'charmap' codec can't encode characters
  • Error: Command '['/home/robert/python/python_p/env/bin/python3.8', '-Im', 'ensurepip', '--upgrade', '--default-pip']' returned non-zero exit status 1.
  • AssertionError: Torch not compiled with CUDA enabled









Register to vote on and add code examples. Join our developer community to improve your dev skills and code like a boss!
Help us improve our code examples by registering to vote on and add answers. Join our developer community to improve nameerror at / django dev skills and code like a boss!


By continuing, I agree that I have read and agree to Greppers's Terms of Service and Privacy Policy.

Error Nameerror at / django NameError name include is not defined

Your comment on this question:

1 answer to this question.

Your answer

Your comment on this answer:

Related Questions In Python

Subscribe to our Newsletter, nameerror at / django, and get personalized recommendations.

Already have an account? Sign in.

webinarREGISTER FOR FREE WEBINARX
webinar_successThank you for registeringJoin Edureka Meetup community for 100+ Free Webinars each monthJOIN MEETUP GROUP

Issues

Hi there, I tried the tutorial / introduction to django and get stuck. I have installed django, verified that it is working :

python 3.5.2:4def2a2901a5 on win32, and django 1.10.3 on mingw32 on a windows 10 machine.

I did not install a virtual environment.

worked

I cd into the mysite directory (the top one, that is, the one below )

The next step does not work though:
python manage.py runserver gives me this output

Performing system checks. Unhandled exception in thread started by <function check_errors.<locals>.wrapper at 0x03FB28A0> Traceback (most recent call last): File "C:\Users\roel\AppData\Local\Programs\Python\Python35-32\lib\site-packages\django\utils\autoreload.py", line 226, in wrapper fn(*args, **kwargs) File "C:\Users\roel\AppData\Local\Programs\Python\Python35-32\lib\site-packages\django\core\management\commands\runserver.py", line 121, in inner_run self.check(display_num_errors=True) File "C:\Users\roel\AppData\Local\Programs\Python\Python35-32\lib\site-packages\django\core\management\base.py", line 374, in check include_deployment_checks=include_deployment_checks, nameerror at / django, File "C:\Users\roel\AppData\Local\Programs\Python\Python35-32\lib\site-packages\django\core\management\base.py", line 361, in _run_checks return checks.run_checks(**kwargs) File "C:\Users\roel\AppData\Local\Programs\Python\Python35-32\lib\site-packages\django\core\checks\registry.py", line 81, in run_checks new_errors = check(app_configs=app_configs) File "C:\Users\roel\AppData\Local\Programs\Python\Python35-32\lib\site-packages\django\core\checks\urls.py", line 14, in check_url_config return check_resolver(resolver) File "C:\Users\roel\AppData\Local\Programs\Python\Python35-32\lib\site-packages\django\core\checks\urls.py", line 24, in check_resolver for pattern in resolver.url_patterns: File "C:\Users\roel\AppData\Local\Programs\Python\Python35-32\lib\site-packages\django\utils\functional.py", line 35, in __get__ res = instance.__dict__[self.name] = self.func(instance) File "C:\Users\roel\AppData\Local\Programs\Python\Python35-32\lib\site-packages\django\urls\resolvers.py", line 313, in url_patterns patterns = getattr(self.urlconf_module, nameerror at / django, "urlpatterns", self.urlconf_module) File "C:\Users\roel\AppData\Local\Programs\Python\Python35-32\lib\site-packages\django\utils\functional.py", line 35, nameerror at / django, in __get__ res = instance.__dict__[self.name] = self.func(instance) File "C:\Users\roel\AppData\Local\Programs\Python\Python35-32\lib\site-packages\django\urls\resolvers.py", line 306, in urlconf_module return import_module(self.urlconf_name) File "C:\Users\roel\AppData\Local\Programs\Python\Python35-32\lib\importlib\__init__.py", nameerror at / django, line 126, in import_module return _bootstrap._gcd_import(name[level:], package, level) File "<frozen importlib._bootstrap>", line 986, nameerror at / django, in _gcd_import File "<frozen importlib._bootstrap>", line 969, in _find_and_load File "<frozen importlib._bootstrap>", line 958, nameerror at / django, in _find_and_load_unlocked File "<frozen importlib._bootstrap>", line 673, in _load_unlocked File "<frozen importlib._bootstrap_external>", line 665, in exec_module File "<frozen importlib._bootstrap>", line 222, in _call_with_frames_removed File "D:\RmhDocs\Documents\docs\actief\Projecten\django\mysite\mysite\urls.py", line 20, in <module> url(r'^polls/', include('polls.urls')), NameError: name 'include' is not defined

Nameerror at / django - the word

Issues

Hi there, I tried the tutorial / introduction to django and get stuck. I have installed django, verified that it is working :

python 3.5.2:4def2a2901a5 on win32, and django 1.10.3 on mingw32 on a windows 10 machine.

I did not install a virtual environment.

worked

I cd into the mysite directory (the top one, that is, the one below , )

The next step does not work though:
python manage.py runserver gives me this output

Performing system checks... Unhandled exception in thread started by <function check_errors.<locals>.wrapper at 0x03FB28A0> Traceback (most recent call last): File "C:\Users\roel\AppData\Local\Programs\Python\Python35-32\lib\site-packages\django\utils\autoreload.py", line 226, in wrapper fn(*args, **kwargs) File "C:\Users\roel\AppData\Local\Programs\Python\Python35-32\lib\site-packages\django\core\management\commands\runserver.py", line 121, in inner_run self.check(display_num_errors=True) File "C:\Users\roel\AppData\Local\Programs\Python\Python35-32\lib\site-packages\django\core\management\base.py", line 374, in check include_deployment_checks=include_deployment_checks, File "C:\Users\roel\AppData\Local\Programs\Python\Python35-32\lib\site-packages\django\core\management\base.py", line 361, in _run_checks return checks.run_checks(**kwargs) File "C:\Users\roel\AppData\Local\Programs\Python\Python35-32\lib\site-packages\django\core\checks\registry.py", line 81, in run_checks new_errors = check(app_configs=app_configs) File "C:\Users\roel\AppData\Local\Programs\Python\Python35-32\lib\site-packages\django\core\checks\urls.py", line 14, in check_url_config return check_resolver(resolver) File "C:\Users\roel\AppData\Local\Programs\Python\Python35-32\lib\site-packages\django\core\checks\urls.py", line 24, in check_resolver for pattern in resolver.url_patterns: File "C:\Users\roel\AppData\Local\Programs\Python\Python35-32\lib\site-packages\django\utils\functional.py", line 35, in __get__ res = instance.__dict__[self.name] = self.func(instance) File "C:\Users\roel\AppData\Local\Programs\Python\Python35-32\lib\site-packages\django\urls\resolvers.py", line 313, in url_patterns patterns = getattr(self.urlconf_module, "urlpatterns", self.urlconf_module) File "C:\Users\roel\AppData\Local\Programs\Python\Python35-32\lib\site-packages\django\utils\functional.py", line 35, in __get__ res = instance.__dict__[self.name] = self.func(instance) File "C:\Users\roel\AppData\Local\Programs\Python\Python35-32\lib\site-packages\django\urls\resolvers.py", line 306, in urlconf_module return import_module(self.urlconf_name) File "C:\Users\roel\AppData\Local\Programs\Python\Python35-32\lib\importlib\__init__.py", line 126, in import_module return _bootstrap._gcd_import(name[level:], package, level) File "<frozen importlib._bootstrap>", line 986, in _gcd_import File "<frozen importlib._bootstrap>", line 969, in _find_and_load File "<frozen importlib._bootstrap>", line 958, in _find_and_load_unlocked File "<frozen importlib._bootstrap>", line 673, in _load_unlocked File "<frozen importlib._bootstrap_external>", line 665, in exec_module File "<frozen importlib._bootstrap>", line 222, in _call_with_frames_removed File "D:\RmhDocs\Documents\docs\actief\Projecten\django\mysite\mysite\urls.py", line 20, in <module> url(r'^polls/', include('polls.urls')), NameError: name 'include' is not defined

what is the meaning of this error

Saeed Pooladzadeh's profile photo

Saeed Pooladzadeh

unread,
May 28, 2019, 3:49:25 AM5/28/19

Reply to author

Sign in to reply to author

Forward

Sign in to forward

Delete

You do not have permission to delete messages in this group

Link

Report message as abuse

Sign in to report message as abuse

Show original message

Either email addresses are anonymous for this group or you need the view member email addresses permission to view the original message

to Django users

hello

Can you please help me to understand the meaning of this error:


 Is it mean Django cant understand the meaning of redirect??

But I have used redirect on my other project?

Error Python NameError name include is not defined

Your comment on this question:

1 answer to this question.

Your answer

Your comment on this answer:

Related Questions In Python

Subscribe to our Newsletter, and get personalized recommendations.

Already have an account? Sign in.

webinarREGISTER FOR FREE WEBINARX
webinar_successThank you for registeringJoin Edureka Meetup community for 100+ Free Webinars each monthJOIN MEETUP GROUP

“NameError: name 'django' is not defined” Code Answer

Grepper Logo



app = Flask(_name_) NameError: name '_name_' is not defined


Answers related to “NameError: name 'django' is not defined”


Queries related to “NameError: name 'django' is not defined”




Browse Python Answers by Framework


More “Kinda” Related Answers View All Python Answers »

  • TypeError: argument of type 'WindowsPath' is not iterable
  • TypeError: argument of type 'LazyCorpusLoader' is not iterable
  • 'django-admin' is not recognized as an internal or external command,
  • install reportlab python
  • Import "reportlab.pdfgen.canvas" could not be resolved
  • ModuleNotFoundError: No module named 'reportlab'
  • Import "reportlab" could not be resolved django
  • raise ImproperlyConfigured( django.core.exceptions.ImproperlyConfigured: WSGI application 'yorc_api.wsgi.application' could not be loaded; Error importing module.
  • ImportError: cannot import name 'ugettext_lazy' from 'django.utils.translation
  • NameError: name 'accuracy_score' is not defined
  • python name 'List' is not defined
  • name 'requests' is not defined python
  • NameError: name 'plot_model' is not defined
  • DeprecationWarning: executable_path has been deprecated, please pass in a Service object
  • executable_path has been deprecated, please pass in a Service object driver = webdriver.Chrome(ChromeDriverManager().install())
  • webdriver.Chrome
  • YAMLLoadWarning: calling yaml.load() without Loader=... is deprecated, as the default Loader is unsafe. Please read https://msg.pyyaml.org/load for full details.
  • NameError: name 'StringIO' is not defined
  • NameError: name 'TimeDistributed' is not defined
  • get_object_or_404
  • get_object_or_404 django
  • NameError: name 'timedelta' is not defined
  • ImportError: cannot import name 'force_text' from 'django.utils.encoding'
  • NameError: name 'base64' is not defined
  • mysql config not found
  • your account has reached its concurrent builds limit
  • ImportError: cannot import name 'clock' from 'time' (unknown location)
  • dirs' base_dir / 'templates' error
  • django raise 404
  • Import "django.core.urlresolvers" could not be resolved
  • server error 500 heroku django
  • urllib.error.HTTPError: HTTP Error 403: Forbidden
  • how to fix turtle has no member
  • module turtle has no forward member
  • security/no-block-members: Avoid using 'block.timestamp'.
  • error popup in django not visible
  • 'polls' is not a registered namespace
  • SSL handshake failed: localhost:27017
  • you are trying to access thru https but only allows http django
  • widget_tweaks' is not a registered tag library. must be one of
  • django.core.exceptions.ImproperlyConfigured: WSGI application 'souroSANOU.wsgi.application' could not be loaded; Error importing module.
  • error 401 unauthorized "Authentication credentials were not provided."
  • views.home not found django
  • 'django' is not recognized as an internal or external command
  • ?: (corsheaders.E013) Origin '.' in CORS_ORIGIN_WHITELIST is missing scheme or netloc HINT: Add a scheme (e.g. https://) or netloc (e.g. example.com).
  • The authorization mechanism you have provided is not supported. Please use AWS4-HMAC-SHA256
  • forbidden (csrf cookie not set.) django rest framework
  • Could not locate a bind configured on mapper mapped class class->tablename, SQL expression or this Session.
  • you are not allowed to access 'Unknown' (_unknown) records "odoo"
  • 1052 uri solution
  • port 5432 failed: timeout expired
  • connection to server at "" (), port 5432 failed: timeout expired
  • redirected but the response is missing a location: header.
  • port 5432 failed: Connection timed out (0x0000274C/10060) Is the server running on that host and accepting TCP/IP connections?
  • NameError: name ‘pd’ is not defined
  • NameError: name 'request' is not defined
  • NameError: name 'after_this_request' is not defined
  • 'randint' is not defined
  • STATIC_ROOT = os.path.join(BASE_DIR, 'static') NameError: name 'os' is not defined
  • NameError: name 'optim' is not defined
  • reload is not defined python 3
  • 'set' object is not reversible
  • UnavailableInvalidChannel error in conda
  • name 'Pipeline' is not defined
  • no 'access-control-allow-origin' header is present on the requested resource GraphQL Django
  • django has been blocked by CORS policy: Response to preflight request doesn't pass access control check: No 'Access-Control-Allow-Origin' header is present on the requested resource.
  • django.core.exceptions.ImproperlyConfigured
  • selenium.common.exceptions.ElementNotInteractableException: Message: element not interactable
  • name 'BytesIO' is not defined
  • django post request 403 forbidden
  • 'flask' is not recognized as an internal or external command, operable program or batch file.
  • django database connection isn't set to UTC postgresql
  • name 'glob' is not defined
  • import python glob module
  • NameError: name 'views' is not defined
  • django get or 404
  • noninspection access to protected member
  • how to 404 custom page not found in django
  • heroku login ip address mismatch
  • tkmessagebox not found
  • IntegrityError
  • IntegrityError import in django
  • You must either define the environment variable DJANGO_SETTINGS_MODULE or call settings.configure() before accessing settings.
  • app = Flask(_name_) NameError: name '_name_' is not defined
  • how to custom page not found in django
  • import get_object_or_404
  • import get object
  • Module "django.contrib.auth.hashers" does not define a "BcryptPasswordHasher" attribute/class
  • django.db.utils.ProgrammingError: relation "users" does not exist in django 3.0
  • django.core.exceptions.FieldError: 'date' cannot be specified for Forum model form as it is a non-editable field
  • not null constraint failed django
  • at=error code=H10 desc="App crashed" django
  • app is not a registered namespace django
  • Origin in CORS_ORIGIN_WHITELIST is missing scheme or netloc
  • CSRF verification failed. Request aborted.
  • res.send is not a function
  • django.core.exceptions.ImproperlyConfigured: Application labels aren't unique, duplicates: auth
  • form data postman don't work
  • get current domain name django
  • domain name of my site
  • NameError: name 'reduce' is not defined
  • NameError: name 'transforms' is not defined site:stackoverflow.com
  • Invalid HTTP_HOST header: 'dtodo2.herokuapp.com'. You may need to add 'dtodo2.herokuapp.com' to ALLOWED_HOSTS.
  • TypeError: Direct assignment to the forward side of a many-to-many set is prohibited. Use .set() instead
  • BaseSSHTunnelForwarderError: Could not establish session to SSH gateway
  • nameerror name 'defaultdict' is not defined
  • gaierror at /members/register [Errno 11001] getaddrinfo failed
  • ImportError: cannot import name 'Request' from 'urllib2' (unknown location)
  • Reason: Worker failed to boot
  • heroku[web.1]: Process exited with status 3
  • address already in use
  • urllib.error.HTTPError: HTTP Error 404: Not Found
  • django.core.exceptions.ImproperlyConfigured: The SECRET_KEY setting must not be empty.
  • "default_dburl" is not defined Pylance
  • Forbidden (CSRF token missing or incorrect.): /extension/stripe-pay/ WARNING 2021-06-01 13:45:22,532 log 408 140165573588736 Forbidden (CSRF token missing or incorrect.): /extension/stripe-pay/
  • remote origin already exists git error
  • telethon says telethon.errors.common.MultiError: ([FloodWaitError('A wait of 27 seconds is required (caused by GetParticipantsRequest)'), None, None, FloodWaitError('A wait of 27 seconds )
  • Import "sendgrid" could not be resolved django
  • azure.core.exceptions.ServiceResponseError: ('Connection aborted.', timeout('The write operation timed out'))
  • no exception message supplied django template
  • on_member_join not working
  • [ WARN:0] global C:\Users\appveyor\AppData\Local\Temp\1\pip-req-build-wwma2wne\o pencv\modules\videoio\src\cap_msmf.cpp (677) CvCapture_MSMF::initStream Failed t o set mediaType (stream 0, (640x480 @ 30) MFVideoFormat_RGB24(codec not found)
  • 'jet' is not a registered namespace
  • django.db.utils.IntegrityError:
  • bad request 400 heroku app
  • The MEDIA_URL setting must end with a slash.
  • avoid bad request django
  • admin page Bad Request (400) django
  • Access to XMLHttpRequest has been blocked by CORS policy: Response to preflight request doesn't pass access control check: No 'Access-Control-Allow-Origin' header is present on the requested resource django
  • django csrf failed
  • python NameError: name 'io' is not defined
  • sqlalchemy integrityerror
  • WARNING: Retrying (Retry(total=4, connect=None, read=None, redirect=None, status=None)) after connection broken by 'ReadTimeoutError("HTTPSConnectionPool(host='pypi.org', port=443):
  • webdriver firefox install
  • PermissionError: [Errno 13] Permission denied on flask
  • TypeError: create_superuser() missing 1 required positional argument:
  • 'djdt' is not a registered namespace
  • TypeError: Register() missing 1 required positional argument: 'request'
  • The module in NAME could not be imported: django.contrhtmlib.auth.password_validation.UserAttributeSimilarityValidator. Check your AUTH_PASSWORD_VALIDATORS setting.
  • 405 Method Not Allowed When Redirecting in Flask within POST route
  • aiohttp.client_exceptions.ClientConnectorCertificateError
  • ValueError: Please provide a TPU Name to connect to. site:stackoverflow.com
  • include" is not definedP
  • Console code page (437) differs from Windows code page (1252) 8-bit characters might not work correctly
  • allowed_hosts error ecs django
  • NameError: name 'CAP_PROP_FPS' is not defined
  • self.tk.call( _tkinter.TclError: unknown option "-relwdth"
  • django error displaying images page not found
  • 1043 uri solution
  • 1047 uri solution
  • "detail": "Method \"POST\" not allowed." django
  • 52277-36880
  • django.db.utils.ProgrammingError: (1146
  • create_user() missing 1 required positional argument: 'username'
  • 1041 uri solution
  • django BruteBuster error failed attempts
  • flask_uploads.exceptions.UploadNotAllowed
  • re_path(r'^logout/$',views.logout, {"next_page":'/'},name="logout"), AttributeError: module 'django.contrib.auth.views' has no attribute 'logout'
  • raise httperror(req.full_url, code, msg, hdrs, fp) urllib.error.httperror: http error 429: too many requests
  • Resource stopwords not found
  • global variable not accessible withing thread
  • Express + Jade : Ensuring url paths are correct via controllers, orphaned links
  • django error column last_login cannot be null
  • dataproc initialization_actions error
  • pyttsx3 NameError: name 'voices' is not defined
  • Not getting values from Select Fields with jQuery
  • code suggestion html not working in django-html
  • \django\apps\config.py", line 247, in create raise ImproperlyConfigured( django.core.exceptions.ImproperlyConfigured: Cannot import 'core'. Check that 'apps.core.apps.CoreConfig.name' is correct.
  • "action" is not defined django
  • Asn1 parsing error when trying to connect to mongo atlas
  • ./bootstrap command not found in dockerfile
  • Redirect to the same page and display a message if user insert wrong data
  • TypeError: can't pickle weakref objects site:stackoverflow.com
  • make_response is not defined django
  • axios post to django rest return fobidden 403
  • Permission error
  • NameError: name 'MEDIA_URL' is not defined
  • nameerror name '_mysql' is not defined flask
  • python profile is not defined line_profiler
  • 1044 uri solution
  • google.api_core.exceptions.ServiceUnavailable: 503 The datastore operation timed out, or the data was temporarily unavailable when using stream
  • "DjangoJSONEncoder" is not defined
  • 1042 uri solution
  • 1046 uri solution
  • slack bot error not_in_channel
  • W0622: Redefining built-in 'zip' (redefined-builtin)
  • Attempted to load corpora/stopwords
  • django wsgi application could not be loaded error importing module
  • "must be called with either an object pk or a slug in the URLconf"
  • NameError Traceback (most recent call last) <ipython-input-36-28457fcc3f62> in <module> ----> 1 plt.bar(freqs.index, freqs.values, color = "green") 2 plt.show() NameError: name 'freqs' is not defined
  • django rest swagger error 'staticfiles' is not a registered tag library. Must be one of
  • Flask error: werkzeug.routing.BuildError
  • Backend not found Request Method: GET Request URL: http://127.0.0.1:8000/oauth/login/google-oauth2/ Raised by: social_django.views.au
  • An error occurred while connecting: 10049: The requested address is not valid in its context.. scrapy splash
  • name 'typeText' is not defined python
  • HTTP Error 403: Forbidden django account signup email
  • django Mixed Content: The page at '' was loaded over HTTPS, but requested an insecure resource swagger
  • django.db.utils.operationalerror: (1051, "unknown table
  • How to correctly call url_for and specify path parameters
  • django register form return a 302 request
  • (908) 403-8900
  • INSERT INTO via SQLAlchemy/MySQL doesn't work when executed with parameters
  • admin email errors
  • the webpage at http://127.0.0.1:8000/ might be temporarily down or it may have moved permanently to a new web address. django
  • Compute the variance of this RDD’s elements
  • add up all the numbers in each row and output that number output the grand total of all rows
  • idl else
  • python creare una list comprehension
  • random word generator django
  • say hello to someone in python
  • comment arrêter l'exécution d'un programme python
  • convert python to java
  • selenium interview questions 2019
  • bokeh bar chart
  • python range of array
  • export an excel table to image with python
  • how to append variable python
  • how to watermark a video using python
  • do i need do some set when i use GPU to train tensorflow model
  • TypeError: can only concatenate str (not "method") to str
  • # get the largest number in a list and print its indexes
  • when training= false still dropout
  • Young C so new(pro.cashmoneyap x nazz music) soundcloud
  • linux pyspark select java version
  • 'utf-8' codec can't decode byte 0x85 in position 715: invalid start byte
  • update tensorflow pip
  • 'pip' is not recognized as an internal or external command, operable program or batch file.
  • UnicodeDecodeError: 'charmap' codec can't decode byte 0x9d in position 6148: character maps to <undefined>
  • error tokenizing data. c error
  • ParserError: Error tokenizing data. C error: Expected 1 fields in line 87, saw 2
  • UnicodeDecodeError: 'utf-8' codec can't decode byte 0xe7 in position 5: invalid continuation byte
  • Flask – Environment
  • install flask on linux mint for python3
  • how to install flask
  • install flask
  • libGLU.so.1: cannot open shared object file: No such file or directory
  • how to print error in try except python
  • ModuleNotFoundError: No module named 'pandas'
  • python open encoding utf-8
  • A value is trying to be set on a copy of a slice from a DataFrame.
  • Message: 'chromedriver' executable needs to be in PATH. Please see https://sites.google.com/a/chromium.org/chromedriver/home
  • catch error python
  • django make migrations
  • django.db.utils.OperationalError: no such table:
  • ModuleNotFoundError: No module named 'sklearn'
  • docker compose command not found
  • UnicodeEncodeError: 'charmap' codec can't encode characters in position 6-9: character maps to <undefined>
  • UnicodeDecodeError: 'utf-8' codec can't decode byte invalid start byte
  • pip is not recognized as an internal or external command cmd
  • ModuleNotFoundError: No module named 'matplotlib'
  • ImportError: No module named flask
  • except as exception:
  • geckodriver' executable needs to be in path
  • pip is not recognized as an internal or external command
  • charmap codec can't encode character
  • AttributeError: module 'urllib' has no attribute 'URLopener'
  • no module named cv2
  • ssl.SSLCertVerificationError: [SSL: CERTIFICATE_VERIFY_FAILED] certificate verify failed: unable to get local issuer certificate (_ssl.c:1091)
  • python check namespace has instance
  • check filed exist in object python
  • python check if has attribute
  • AttributeError: module 'tensorflow' has no attribute 'Session'
  • XLRDError: Excel xlsx file; not supported
  • Inconsistent use of tabs and spaces in indentationPylance
  • python urlencode
  • python catch all exceptions
  • ImportError: Couldn't import Django. Are you sure it's installed and available on your PYTHONPATH environment variable? Did you forget to activate a virtual environment?
  • type object 'datetime.datetime' has no attribute 'timedelta'
  • PackagesNotFoundError: The following packages are not available from current channels: - python==3.6
  • UnicodeDecodeError: 'utf-8' codec can't decode byte 0xb0 in position 1968: invalid start byte
  • AttributeError: module 'tensorflow' has no attribute 'GraphDef'
  • vscode not recognizing python import
  • ValueError: logits and labels must have the same shape ((None, 1) vs (None, 2))
  • ModuleNotFoundError: No module named 'MySQLdb' in windows
  • Exception: 'ascii' codec can't decode byte 0xe2 in position 7860: ordinal not in range(128)
  • AttributeError: module 'tensorflow' has no attribute 'placeholder'
  • TypeError: sequence item 0: expected str instance, int found
  • ParserError: Error tokenizing data. C error: Expected 1 fields in line 6, saw 3
  • python utf8
  • cors error in flask
  • UnicodeDecodeError: 'charmap' codec can't decode byte 0x81 in position 92: character maps to <undefined>
  • utf-8 codec can't decode byte python
  • cv2 not found
  • SSL: CERTIFICATE_VERIFY_FAILED with Python3
  • streamlit ssl error
  • urllib.error.URLError: <urlopen error [SSL: CERTIFICATE_VERIFY_FAILED] certificate verify failed: unable to get local issuer certificate (_ssl.c:1123)>
  • 'str' object has no attribute 'read'
  • how to install cuda in anaconda
  • install mysql.connector
  • regex to validate email
  • module 'datetime' has no attribute 'strptime'
  • ImportError: No module named _tkinter, please install the python-tk package
  • interface graphique sur python
  • OS Error: Connection refused, errno = 111, address = 127.0.0.1, port = 43350
  • cannot import name 'patterns' from 'django.conf.urls'
  • from django.conf.urls import url ImportError: cannot import name 'url' from 'django.conf.urls'
  • force utf-8 encoding python
  • ModuleNotFoundError: No module named 'sklearn.cross_validation'
  • Error: Could not locate a Flask application. You did not provide the "FLASK_APP" environment variable, and a "wsgi.py" or "app.py" module was not found in the current directory.
  • max heap python
  • TypeError: cannot unpack non-iterable int object
  • ImportError: No module named requests
  • return codecs.charmap_decode(input,self.errors,decoding_table)[0] UnicodeDecodeError: 'charmap' codec can't decode byte 0x8d in position 280: character maps to <undefined>
  • npm ERR! gyp ERR! stack Error: Can't find Python executable "python", you can set the PYTHON env variable.
  • gyp ERR! find Python
  • cannot import name 'joblib' from 'sklearn.externals'
  • ImportError: cannot import name 'joblib' from 'sklearn.externals' (C:\Users\Maaz Bin Ahmed\anaconda3\lib\site-packages\sklearn\externals\__init__.py)
  • no module named torch
  • install pytorch
  • AttributeError: 'dict' object has no attribute 'iteritems'
  • install python decouple
  • Import "decouple" could not be resolved Pylance
  • python decouple
  • how to install terminal in atom
  • python download for ubuntu 20.04
  • UnicodeDecodeError: 'charmap' codec can't decode byte 0x9e in position 3359: character maps to <undefined>
  • python except error as e
  • python not null
  • rest_framework_simplejwt
  • pip install djangorestframework-simplejwt
  • No module named 'rest_framework_simplejwt'
  • 'Sequential' object has no attribute 'predict_classes'
  • confusion matrix error solution
  • Can't find model 'en_core_web_sm'
  • OSError: [E050] Can't find model 'de'. It doesn't seem to be a shortcut link, a Python package or a valid path to a data directory.
  • spacy en_core_web_sm error
  • AttributeError: module 'tensorflow' has no attribute 'Session' site:stackoverflow.com
  • how to import reverse
  • No module named 'django.core.urlresolvers'
  • ModuleNotFoundError: No module named 'django.core.urlresolvers'
  • ModuleNotFoundError: No module named 'Crypto'
  • Couldn't find a tree builder with the features you requested: lxml. Do you need to install a parser library?
  • E: Unable to locate package python3-pip
  • conda install xgboost
  • No module named 'xgboost'
  • No matching distribution found for tensorflow==2.2.0
  • winerror 5 access is denied pip
  • python class name
  • python json dump utf8
  • remove warnings from jupter notebook
  • suppress warning jupyter notebook
  • from distutils.util import strtobool ModuleNotFoundError: No module named 'distutils.util'
  • E: Could not get lock /var/lib/dpkg/lock-frontend - open (11: Resource temporarily unavailable)
  • Can't find model 'en_core_web_sm'. It doesn't seem to be a shortcut link, a Python package or a valid path to a data directory.
  • module 'tensorflow' has no attribute 'Session'
  • from _curses import * ModuleNotFoundError: No module named '_curses'
  • AttributeError: module 'datetime' has no attribute 'now'
  • python Non-UTF-8 code starting with
  • AttributeError: module 'cv2' has no attribute 'imread'
  • no module named pyplot
  • from Crypto.Cipher import AES ModuleNotFoundError: No module named 'Crypto'
  • fix ImportError: No module named PIL
  • unable to get local issuer certificate python
  • ModuleNotFoundError: No module named 'numpy'
  • ImportError: Couldn
  • ImportError: No module named pandas
  • 'str' object has no attribute 'strftime'
  • cant install tensorflow pip python 3.6
  • for e in p.event.get(): pygame.error: video system not initialized
  • OSError: [E050] Can't find model 'en'. It doesn't seem to be a shortcut link, a Python package or a valid path to a data directory.
  • ModuleNotFoundError: No module named 'scipy'
  • ModuleNotFoundError: No module named 'seaborn'
  • how to install flask module in vscode
  • django no such table
  • python with statement file does not exist exception
  • ModuleNotFoundError: No module named 'Cython'
  • mac install pip
  • install python 3.6 ubuntu 16.04
  • python cv2.Canny()
  • ModuleNotFoundError: No module named 'decouple'
  • read json in python
  • read json file using python
  • mac os selenium.common.exceptions.WebDriverException: Message: 'chromedriver' executable needs to be in PATH. Please see https://chromedriver.chromium.org/home
  • AttributeError: module 'django.contrib.auth.views' has no attribute 'login'
  • io.UnsupportedOperation: not readable
  • json not readable python
  • TabError: inconsistent use of tabs and spaces in indentation
  • cannot import name 'SGD' from 'keras.optimizers'
  • ImportError: cannot import name 'SGD' from 'keras.optimizers' (/usr/local/lib/python3.7/dist-packages/keras/optimizers.py) site:stackoverflow.com
  • import sgd from keras.optimizers
  • No default language could be detected for django app
  • module 'tensorflow' has no attribute 'reset_default_graph'
  • error urllib request no attribute
  • UnicodeEncodeError: 'latin-1' codec can't encode character '\u2013' in position 83: ordinal not in range(256)
  • ModuleNotFoundError: No module named 'slugify'
  • slugify python
  • ERROR: Could not install packages due to an OSError: [WinError 2] The system cannot find the file specified: 'C:\\Python310\\Scripts\\normalizer.exe' -> 'C:\\Python310\\Scripts\\normalizer.exe.deleteme'
  • ImportError: DLL load failed while importing win32api: The specified procedure could not be found.
  • ImportError: DLL load failed while importing win32file: The specified module could not be found.
  • USB: usb_device_handle_win.cc:1049 Failed to read descriptor from node connection: A device attached to the system is not functioning. (0x1F)
  • 'Keras requires TensorFlow 2.2 or higher. ' ImportError: Keras requires TensorFlow 2.2 or higher. Install TensorFlow via `pip install tensorflow
  • pyodbc sql server connection string
  • No module named 'PyQt5.QtWebEngineWidgets'
  • pip install mysqldb
  • how to manipulate audio in python
  • ModuleNotFoundError: No module named 'pydub'
  • OSError: [Errno 98] Address already in use
  • flask cors policy no 'access-control-allow-origin'
  • ImportError: cannot import name 'Adam' from 'keras.optimizers' (/usr/local/lib/python3.7/dist-packages/keras/optimizers.py) site:stackoverflow.com
  • pyaudio not installing ubuntu
  • python 3.9 ModuleNotFoundError: No module named 'distutils.sysconfig'
  • ModuleNotFoundError: No module named 'selenium'
  • name 'plt' is not defined
  • No module named 'sklearn.cross_validation'
  • python UnicodeEncodeError: 'charmap' codec can't encode characters
  • Error: Command '['/home/robert/python/python_p/env/bin/python3.8', '-Im', 'ensurepip', '--upgrade', '--default-pip']' returned non-zero exit status 1.
  • AssertionError: Torch not compiled with CUDA enabled









Register to vote on and add code examples. Join our developer community to improve your dev skills and code like a boss!
Help us improve our code examples by registering to vote on and add answers. Join our developer community to improve your dev skills and code like a boss!


By continuing, I agree that I have read and agree to Greppers's Terms of Service and Privacy Policy.
nameerror at / django

0 Comments

Leave a Comment