General error sql error 144

general error sql error 144

An error is generated when running a SELECT statement. Query fails on a table with more than 2 million records. It will run against a smaller. Explanation: The specified character is not a valid character in SQL statements. User Response: Correct the syntax and resubmit the statement. Note that error (no more room in record file) and error (no more room in index file) are not errors that can be fixed by a simple repair. In this case. general error sql error 144

General error sql error 144 - you are

Fix: MySQL table is marked as crashed and last repair failed

Contents

If you are using MySQL Command-line client to query your database, you may come across an error which says:

“MySQL Table is marked as crashed and last (automatic?) Repair failed”.

The error can be caused due to many reasons including zero disk space available on the server, a hard reset of server, forced shutdown of MySQL, or MySQL process crashing due to some reason.

There are different ways to resolve this error and the right method depends on its root cause. First, we will discuss a common solution that can be used in several cases.

Solution One &#; Repair table using myisamchk command

  1. Login in your server using SSH command like &#; ssh [email protected]
  2. Stop the MySQL daemon/service by executing the command- service mysql stop
  3. Change directory to your MySQL database. The directory is usually located in /var/lib/mysql. The command to use is cd /var/lib/mysql/YOUR_DATABASE_NAME
  4. Now, you have to simply run the myisamchk command by executing &#; myisamchk -r table_name

Note &#; In the above step you have to replace the actual table name with “table name”. The output of the command will mention the recovery of the table and also fix any corrupt records.

  1. Start the MySQL service
    again by executing command &#; service mysql start

The MySQL table problem would be resolved now and you can query tables in the database through MySQL CLI.

Solution Two &#; Find and Fix broken tables

 If you are getting this error, it indicates one or more tables in the database are corrupt and need to be fixed. The first step in this solution is to find the tables that are the cause of the error. Here are the steps to follow.

To find the table marked as crashed and needs to be repaired, execute these commands

  1. # myisamchk -s /var/lib/mysql/*/*.MYI
  2. MyISAM-table &#;/var/lib/mysql/dbname/table_sprers.eu&#; is marked as crashed and should be repaired

The above command will list all tables that are marked as crashed and need to be repaired

  1. To repair the table, execute the following command &#; # myisamchk -r /var/lib/mysql/dbname/table_sprers.eu

You need to execute this command for every table that is marked as crashed and needs to be repaired. Every time the value of table_name would be different.

  1. The above solution will resolve the error. If it doesn’t you need to stop the Stop the MySQL daemon/service by executing the command- service mysql stop

After the MySQL web service is stopped you need to update the state of the tables so that MySQL CLI knows the corrupt tables have been checked and repaired. Execute the command given below to update the state of the table.

  1. myisamchk -r &#;update-state /var/lib/mysql/dbname/table_sprers.eu

After you have updated the state of every repaired table, you need to restart the MySQL service. Execute the command given below to start the MySQL service.

  1. service mysql start

Solution Three – Different ways to repair corrupt tables

As discussed in the earlier solution, the easiest way to resolve the error is repairing the corrupt tables. While we have discussed one way to find and repair corrupt tables, there are alternative ways too that you would like to know. Here we have discussed different ways to find and repair corrupt tables.

Stage One – Check Tables

Run myisamchk *.MYI or myisamchk -e *.MYI. You can also use the silent option to suppress unnecessary information. The command syntax is myisamchk &#;silent *.MYI

Some of the symptoms of the corrupted table manifest as queries that are aborted unexpectedly, and you get errors such as :

  • Unexpected end of file
  • Can&#;t find file tbl_sprers.eu (Errcode: nnn)
  • Record file is crashed
  • Got error nnn from table handler
  • tbl_sprers.eu is locked against change

To get more information about the error, use the run perror nnn, where nnn is the error number.

Stage Two – Easy Safe Repair

After you have found tables that are corrupt, you need to try the command

  1. Use myisamchk -r -q tbl_name

Here the -r -q means “quick recovery mode. This command will attempt to repair the index file of the table without touching the data file. If the table is not repaired due to some reason, execute the commands given below.

  1. Create a backup of the data file before proceeding
  2. Use myisamchk -r tbl_name. Here -r means “recovery mode”. The command removes incorrect rows and deleted rows from the data file and reconstructs the index file. If this step fails, execute the command below
  3. Use myisamchk &#;safe-recover tbl_name. This is an old recovery method used in specific cases where the normal recovery mode fails

Since the Safe Recovery mode is slow, you need to be patient while data recovery happens. To speed up the recovery process, set the values of key_buffer_size and the sort_buffer_size variables each to about 25% of your available memory when running myisamchk.

Stage 3 &#; Difficult repair

Not all tables’ recovery is simple. In many cases, the index file is missing or first 16KB block in the index file is destroyed or contains incorrect information. These are categorized as difficult repair and need a different approach.

To resolve such cases, you need to create a new index file. Here are the steps to follow.

  1. Move data file to a safe place
  2. Create new empty data file and index file using the commands given below
    • mysql db_name
    • SET autocommit=1;
    • TRUNCATE TABLE tbl_name;
    • Quit
  3. Copy the old data file into the newly created data file.
  4. Now go back to Stage 2 and execute the commands and they should work to recover tables.

What to do if none of these solutions work?

If you’re unable to resolve the error by using the above-mentioned methods, do not despair. You can use an automated solution to the problem. Stellar Repair for MySQL is a worthwhile and reliable solution to the “MySQL table is marked as crashed and last repair failed” error.

The software can remove tough errors from MySQL and make the data available for restoration. It has several striking features and an interactive GUI, which makes it easy for operation. If all the available manual methods have failed, you can place your trust in this software without hesitation.

Stellar

Conclusion

We hope the above solutions will work to repair corrupt tables and fix the problem in the database. After you have repaired corrupt tables, the MySQL command-line client should be able to query the database and get the required results.

About The Author

Priyanka

Priyanka is a technology expert working for key technology domains that revolve around Data Recovery and related software's. She got expertise on related subjects like SQL Database, Access Database, QuickBooks, and Microsoft Excel. Loves to write on different technology and data recovery subjects on regular basis. Technology freak who always found exploring neo-tech subjects, when not writing, research is something that keeps her going in life.

Best Selling Products

Stellar Data Recovery Professional for Windows

Stellar Data Recovery Professional for Windows

Stellar Data Recovery has the right Windows Recovery tool for all your data recovery

Read More
Stellar Data Recovery Professional for Mac

Stellar Data Recovery Professional for Mac

Stellar Data Recovery for Mac program performs safe..

 

Read More
Stellar Photo Recovery

Stellar Photo Recovery

A comprehensive photo recovery software to restore photos, music & video files

 

Read More
Stellar Repair for Video

Stellar Repair for Video

Powerful video repair tool for repairing corrupt or damaged MOV and other video files

 

Read More

 How to Repair MyISAM Tables

The discussion in this section describes how to use myisamchk on tables (extensions and ).

You can also use the and statements to check and repair tables. See Section , “CHECK TABLE Statement”, and Section , “REPAIR TABLE Statement”.

Symptoms of corrupted tables include queries that abort unexpectedly and observable errors such as these:

  • Can't find file (Errcode: )

  • Unexpected end of file

  • Record file is crashed

  • Got error from table handler

To get more information about the error, run perror, where is the error number. The following example shows how to use perror to find the meanings for the most common error numbers that indicate a problem with a table:

Note that error (no more room in record file) and error (no more room in index file) are not errors that can be fixed by a simple repair. In this case, you must use to increase the and table option values:

If you do not know the current table option values, use .

For the other errors, you must repair your tables. myisamchk can usually detect and fix most problems that occur.

The repair process involves up to three stages, described here. Before you begin, you should change location to the database directory and check the permissions of the table files. On Unix, make sure that they are readable by the user that mysqld runs as (and to you, because you need to access the files you are checking). If it turns out you need to modify files, they must also be writable by you.

This section is for the cases where a table check fails (such as those described in Section , “How to Check MyISAM Tables for Errors”), or you want to use the extended features that myisamchk provides.

The myisamchk options used for table maintenance with are described in Section , “myisamchk — MyISAM Table-Maintenance Utility”. myisamchk also has variables that you can set to control memory allocation that may improve performance. See Section , “myisamchk Memory Usage”.

If you are going to repair a table from the command line, you must first stop the mysqld server. Note that when you do mysqladmin shutdown on a remote server, the mysqld server is still available for a while after mysqladmin returns, until all statement-processing has stopped and all index changes have been flushed to disk.

Stage 1: Checking your tables

Run myisamchk *.MYI or myisamchk -e *.MYI if you have more time. Use the (silent) option to suppress unnecessary information.

If the mysqld server is stopped, you should use the option to tell myisamchk to mark the table as “checked.”

You have to repair only those tables for which myisamchk announces an error. For such tables, proceed to Stage 2.

If you get unexpected errors when checking (such as errors), or if myisamchk crashes, go to Stage 3.

Stage 2: Easy safe repair

First, try myisamchk -r -q ( means “quick recovery mode”). This attempts to repair the index file without touching the data file. If the data file contains everything that it should and the delete links point at the correct locations within the data file, this should work, and the table is fixed. Start repairing the next table. Otherwise, use the following procedure:

  1. Make a backup of the data file before continuing.

  2. Use myisamchk -r ( means “recovery mode”). This removes incorrect rows and deleted rows from the data file and reconstructs the index file.

  3. If the preceding step fails, use myisamchk --safe-recover . Safe recovery mode uses an old recovery method that handles a few cases that regular recovery mode does not (but is slower).

Note

If you want a repair operation to go much faster, you should set the values of the and variables each to about 25% of your available memory when running myisamchk.

If you get unexpected errors when repairing (such as errors), or if myisamchk crashes, go to Stage 3.

Stage 3: Difficult repair

You should reach this stage only if the first 16KB block in the index file is destroyed or contains incorrect information, or if the index file is missing. In this case, it is necessary to create a new index file. Do so as follows:

  1. Move the data file to a safe place.

  2. Use the table description file to create new (empty) data and index files:

  3. Copy the old data file back onto the newly created data file. (Do not just move the old file back onto the new file. You want to retain a copy in case something goes wrong.)

Important

If you are using replication, you should stop it prior to performing the above procedure, since it involves file system operations, and these are not logged by MySQL.

Go back to Stage 2. myisamchk -r -q should work. (This should not be an endless loop.)

You can also use the SQL statement, which performs the whole procedure automatically. There is also no possibility of unwanted interaction between a utility and the server, because the server does all the work when you use . See Section , “REPAIR TABLE Statement”.


Encountered internal error in SQL ENGINE in sts_sprers.eu

Disclaimer

The origins of the information on this site may be internal or external to Progress Software Corporation (“Progress”). Progress Software Corporation makes all reasonable efforts to verify this information. However, the information provided is for your information only. Progress Software Corporation makes no explicit or implied claims to the validity of this information.

Any sample code provided on this site is not supported under any Progress support program or service. The sample code is provided on an "AS IS" basis. Progress makes no warranties, express or implied, and disclaims all implied warranties including, without limitation, the implied warranties of merchantability or of fitness for a particular purpose. The entire risk arising out of the use or performance of the sample code is borne by the user. In no event shall Progress, its employees, or anyone else involved in the creation, production, or delivery of the code be liable for any damages whatsoever (including, without limitation, damages for loss of business profits, business interruption, loss of business information, or other pecuniary loss) arising out of the use of or inability to use the sample code, even if Progress has been advised of the possibility of such damages.

0RAISERROR executed: %1Error opening cursorINSERT/DELETE on cursor can modify only one tableA log is required for IQ databasesCOMMIT/ROLLBACK not allowed within trigger actionsSyntax error near '%1' %2Syntax error, cannot specify IQ specific options without specifying IQ PATHThere is no way to join to '%1'Foreign key name '%1' not foundTrigger definition conflicts with existing triggersInvalid REFERENCES clause in trigger definitionGRANT of column permission on view not allowedSubquery allowed only one SELECT list itemCannot delete or rename a column referenced in a trigger definitionIdentifier '%1' too longFunction or column reference to '%1' in the ORDER BY clause is invalidInvalid ORDER BY specificationLabel '%1' not foundThere is already a variable named '%1'Variable '%1' not foundData definition statements not allowed in procedures or triggersInvalid option '%1' -- no PUBLIC setting existsWrong number of parameters to function '%1'Transact-SQL feature not supportedUnknown function '%1'Invalid column numberParameter name missing in call to procedure '%1'Parameter '%1' not found in procedure '%2'Signature '%1' does not match procedure parametersSelect lists in UNION, INTERSECT, or EXCEPT do not match in lengthMore columns are being dropped from table '%1' than are definedColumn '%1' not foundCorrelation name '%1' not foundColumn '%1' found in more than one table or it is used more than once in the SELECT list -- it needs a correlation nameDerived table '%1' has no name for column %2Wrong number of values for INSERTProcedure or trigger calls have nested too deeplyValue %1 out of range for destinationCannot modify column '%1' in table '%2'Cannot update an expressionColumn '%1' in table '%2' cannot be NULLNumber of columns allowing NULLs exceeds limitCannot convert %1 to a %2Return type of void from procedure '%1' cannot be used in any expressionPermission denied: %1Duplicate insert columnREADTEXT or WRITETEXT statement cannot refer to a viewThere is more than one way to join '%1' to '%2'Invalid expression in WHERE clause of Transact-SQL outer joinThere is no way to join '%1' to '%2'Invalid join type used with Transact-SQL outer joinCannot uniquely identify rows in cursorOperation would cause a group cycleTable '%1' is in an outer join cycleTable '%1' requires a unique correlation nameFeature '%1' not implementedLanguage extensionInvalid expression near '%1'Too many arguments for function or procedure '%1'Statement size or complexity exceeds server limitsNull value eliminated in aggregate functionArgument %1 of procedure '%2' cannot be NULLProcedure '%1' not foundUser ID '%1' does not existSubquery cannot return more than one rowInvalid data conversionRow has been updated since last time readValue for column '%1' in table '%2' has changedDisallowed language extension detected in syntax near '%1' on line %2No primary key value for foreign key '%1' in table '%2'Primary key for row in table '%1' is referenced by foreign key '%2' in table '%3'Table '%1' has a foreign key with a referential actionIndex '%1' for table '%2' would not be uniqueConstraint '%1' violated: Invalid value for column '%2' in table '%3'Constraint '%1' violated: Invalid value in table '%2'The specified foreign key (%1) cannot be enforcedWITH CHECK OPTION violated for insert/update on base table '%1'Wrong number of variables in FETCHRow has changed since last read -- operation canceledCursor not in a valid stateCursor has not been declaredCursor already openCursor not openRow not foundNo current row of cursorPassword must be at least %1 charactersStatement cannot be executedInvalid SQL descriptor nameUnable to start database serverNot enough memory to startUnable to start database server: missing license fileSpecified local connection ID not foundLocal connection ID does not refer to the current databaseCannot close a remote JDBC connection that is not the current connectionUnable to start specified database: %1Database name required to start serverUnable to start specified database: '%1' is an invalid transaction log mirrorUnable to start specified database: The transaction log '%1' or its mirror '%2' is invalidUnable to start specified database: '%1' not expecting any operations in transaction logUnable to start specified database: Unknown encryption algorithmUnable to start specified database: '%1' must be upgraded to start with this server (capability %2 missing)Unable to start specified database: Cannot use log file '%1' since it has been used more recently than the database fileUnable to start specified database: '%1': transaction log file not foundUnable to start specified database: Cannot use log file '%1' since the offsets do not match the offsets in the database fileUnable to start specified database: Cannot use log file '%1' since the database file has been used more recentlyUnable to start specified database: Cannot use log file '%1' since it is shorter than expectedUnable to start specified database: '%1' is not a databaseUnable to start specified database: '%1' was created by a different version of the softwareUnable to start specified database: '%1' is not a valid database fileUnable to start specified database: '%1' is an invalid transaction logUnable to start database %1: Cannot use read-only mode if auditing is enabledDatabase '%1' cannot be started on this platform. See sprers.euDatabase '%1' cannot be started on this platform. See sprers.euSpecified database not foundSpecified database file already in useDatabase page size too big: %1Invalid database page sizeDatabase creation failed: %1Internal rollback log corruptedRequest denied -- no active databasesThe selected database is currently inactiveDeadlock detectedAll threads are blockedRollback occurred due to deadlock during prefetchDatabase server connection limit exceededCommunication errorClient/server communications protocol version mismatchToo many columns in tableReferential integrity actions other than RESTRICT not allowed for temporary tablesTables related by key constraint must both be permanent, or both be temporary and not created with ON COMMIT DELETE ROWS. For global temporary tables they must both be shared if one is sharedKey constraint between temporary tables requires a primary key (not unique constraint)Table '%1' has no primary keyColumn '%1' in foreign key has a different definition than primary keyDatabase name not uniqueDbspace '%1' not foundDuplicate referencing columnPrimary key column '%1' already definedForeign key '%1' for table '%2' duplicates an existing foreign keyIndex name '%1' not uniqueIndex name '%1' is ambiguousTable cannot have two primary keysTable already has a primary keyCannot open transaction log file -- %1Primary key for table '%1' is not unique: Primary key value ('%2')Table '%1' not foundUser-defined type '%1' not foundUnable to find in index '%1' for table '%2'Error number %1 for RAISERROR must not be less than User message %1 not foundFormat string argument number %1 is invalidI/O error %1 -- transaction rolled backMemory error -- transaction rolled backUnknown backup operationDatabase backup not startedIncomplete transactions prevent transaction log renamingInvalid backup operationDatabase upgrade failedDatabase upgrade not possibleTerminated by user -- transaction rolled backDisk full '%1' -- transaction rolled backError writing to transaction log fileStatement interrupted by userTable in useProcedure in use by '%1'User owns procedures in useUser owns tables in useCan only describe a SELECT statementDatabase cannot be started -- %1Specified database is invalidNo database file specifiedInvalid user ID or passwordInvalid user ID or password on preprocessed moduleThe synchronization failed because MobiLink returned authentication status '%1' with value '%2'Connection not foundConnections to database have been disabledConnection was terminatedCannot insert or update computed column '%1'Number of columns defined for the view does not match SELECT statementView references '%1', which is a temporary object. Views can only refer to permanent objectsTRUNCATE TABLE statement cannot be used on a viewTable must be emptyCannot alter a column in an indexA dbspace has reached its maximum file sizeThe server attempted to access a page beyond the end of the maximum allowable dbspace file sizeLanguage extension detected in syntax near '%1' on line %2Invalid setting for option '%1''%1' is an invalid value for '%2'Invalid database server command lineInvalid parameterInvalid local database optionParse error: %1Parse error: %1Only the DBA can set the option '%1'The option '%1' can only be set as a temporary optionThe option '%1' cannot be set from within a procedureThere are still active database connectionsRequest to start/stop database deniedCannot find index named '%1'Invalid absolute or relative offset in FETCHCannot update column '%1' since it appears in the ORDER BY clauseSavepoint '%1' not foundInvalid TEXTPTR value used with WRITETEXT or READTEXTInvalid data type for column in WRITETEXT or READTEXTInvalid host variableDatabase server not running in multi-user modeUpdate operation attempted on non-updatable queryFOR UPDATE has been incorrectly specified for a READ ONLY cursorFunction or column reference to '%1' must also appear in a GROUP BYValue truncatedUpdate operation attempted on non-updatable remote queryMore than one table is identified as '%1'The specified transaction isolation is invalidInvalid escape sequence '%1'The pattern is too longInvalid escape character '%1'Update operation attempted on a read-only cursorCannot update column '%1' since it does not appear in the SELECT clauseDatabase server not foundDatabase server already runningInvalid descriptor indexError in assignmentUser '%1' has the row in '%2' lockedDynamic memory exhaustedRight truncation of string dataIllegal cursor operation attemptTrigger '%1' not foundExpression has unsupported data typeThe remote server does not support an auto-incrementing data typeCreating remote tables with computed columns is not supportedThe data type of column or variable '%1' is not supportedUnable to connect to server '%1': %2Could not access column information for the table '%1'The column '%1' does not exist in the remote tableThe data type specified for column '%1' is not compatible with the actual data typeThe length specified for column '%1' is different than the actual lengthNULL attribute mismatch for column '%1'Identity attribute mismatch for column '%1'Remote server '%1' could not be foundThe remote table '%1' could not be foundThe table specification '%1' identifies more than one remote tableExternal login for server '%1' could not be foundRemote server does not have the ability to support this statementRemote server '%1' is currently configured as read-onlyItem '%1' already existsThe specified session name '%1' is not validTrace event '%1' already existsToo many arguments for trace event '%1'Trace event session '%1' is active. Stop active session before dropping the sessionTrace event '%1' is not validDropping or altering arbiter "%1" requires a connection to the partnerTrace event '%1' is referenced by one or more sessions. Drop referencing sessions firstThe UltraLite database deploy file is invalid (code: %1, file: %2)Unable to copy file %1Unable to create directory %1File %1 already existsUnable to delete file %1Outer references are not allowed for TPF input tablesThe V4 C/C++ APIs are not supported for this databaseMultiple table parameters are not supportedThe transaction may not be committed because the primary server lost quorumUnable to copy file %1 to destination %2You cannot use a security token when making remote connectionsInvalid tool name or admin user for generating security tokenUnable to load the dbrsakp shared objectServer name can only be specified when connecting to a cloud database server with NODETYPE=DIRECTDatabase name must be specified when connecting to a cloud database serverFailed to load the MobiLink client support librariesExternal procedures or functions are not allowed across server typesTable parameterized functions are not allowed across server typesExternal environment cannot be started, external process terminated on start upExternal environment cannot be started during database startupExternal environment failed to start and establish a connection within the %1 second timeoutLogin redirection is required to complete the connection, but it is not supported by the clientFailed to transform point %1 (error %2)Geometry expressions cannot be used in the ORDER BY specification (near '%1')Format '%1' is not supported in the UNLOAD statementOuter reference not permitted in DML derived tableText index %1 cannot be used with text procedure %2Database needs to be upgraded to support the use of external libraries with text indexesThe intermediate point (%3) of the ST_CircularString segment between %1 and %2 is collinear with but not between the start and end pointsSupport for spatial is not available for this CPUText index with external prefilter cannot contain both binary and string columnsText indexes are not allowed across server typesThe materialized view cannot be changed to immediate because the primary key columns of any table in the preserved side of an OUTER JOIN must exist in the SELECT listThe materialized view cannot be changed to immediate because at least one non-nullable column from any null-supplying side of an OUTER JOIN must exist in the SELECT listThe materialized view cannot be changed to immediate because the ON conditions refer to tables which are not in the null-supplying and preserved sides of the OUTER JOINsUnknown collation '%1'Database contains no tables to synchronizeVERIFY and RENAME cannot be used togetherUsing temporary tableCannot specify range that excludes next value for sequence %1CircularString with 3 points has been converted to use 5 pointsPolygon ring order has been reorientedPosition %1 is invalid (should be between %2 and %3)Invalid polygon: ring is larger than allowed for SRID=%1 (near '%2')Invalid polygon: curve is not a ringInvalid polygon: ring has zero area (near '%1')Invalid polygon: ring is not closed (near '%1')Value %1 out of range for coordinate %2 (SRS bounds [%3, %4] exceeded by more than 50%)LineString must contain at least 2 points (near '%1')Curve contains nearly antipodal points %1 and %2 (near '%3')An internal error has occurred in the spatial libraryAn expression of type %1 is not union-compatible with type %2ST_Geometry arguments not supported by SQL function %1The SRID %1 does not identify a geographic spatial reference systemSRID %1 is referenced by domain "%3"."%2"SRID %1 is referenced by parameter '%2' of procedure '%3'SRID %1 is referenced by column '%2' of table '%3'Spatial unit of measure "%1" is reservedSpatial reference system "%1" is reservedSpatial reference system %1 cannot be modified because it is in useInvalid storage format '%1'The specified polygon format '%1' is not supported for this type of spatial reference systemThe specified axis order is not supported for this type of spatial reference systemCoordinate bounds missing for coordinate %1Ellipsoid parameters specified for non-geographic spatial reference systemEllipsoid parameters missing for geographic spatial reference systemThe spatial reference system type is not supported ('%1')Error parsing definition string '%1'Spatial reference system must specify the SRID to useSpatial reference system '%1' already existsUnit of measure '%1' already existsSpatial reference system '%1' not foundUnit of measure '%1' not foundThe string '%1' is not a valid coordinate nameThe string '%1' is not a valid axis orderThe CONVERT USING clause must be specified when creating a unit of measureSpatial column '%1' cannot be included in an index because it is not constrained to a single SRIDSpatial column '%1' cannot be included in a primary key or unique indexTable '%1' contains a spatial column '%2' and no primary keyInvalid polygon: multiple exterior ringsInvalid polygon nestingInvalid polygon: no exterior ringInvalid polygon format '%1'Unit of measure "%1" is not an angular unitUnit of measure "%1" is not a linear unitTransform from SRID %1 not supportedTransform from SRID %1 to %2 not supportedTransform definition is too longInvalid transform definition '%1'Invalid spatial reference system well-known-text (WKT)The comparison '%1' cannot be used with geometriesInvalid configuration name %1Error reading configuration fileMirror server "%1" defined with type COPY does not include a parent definitionA geometry with SRID=%1 is not supported when computing distance between non-point geometriesA geometry with SRID=%1 is not supported for method %2The data is not in a recognized formatThe value '%2' is not a valid setting for the '%1' format specification optionThe format specification option '%1' is not recognizedThe format specification syntax is invalidAn input string in '%1' format cannot be used hereThe format type '%1' cannot be used hereThe format type '%1' is not recognizedThe embedded SRID are inconsistent (%1 and %2)The embedded SRID (%1) conflicts with the provided SRID (%2)The multi patch shapefile shape is not supportedInvalid shapefile filenameError parsing shapefile attributesError parsing shapefile recordError parsing well-known-binary (WKB): invalid byte order mark %1 at offset %2Error parsing well-known-binary (WKB): inconsistent dimensions at offset %1Error parsing well-known-binary (WKB): unexpected end of inputError parsing well-known-binary (WKB): type code %1 at offset %2 is not a valid subtype of the parentError parsing well-known-binary (WKB): type code %1 at offset %2 is invalidError from external library: -%1: %2Error parsing geometry internal serialization at offset %1Error parsing well-known-text (WKT): inconsistent dimensions at offset %1Spatial feature %1 is not supportedSupport for spatial is not available for this databaseCannot convert from %1 to %2 (near %3)An ST_CircularString cannot be constructed from %1 points (near '%2')Unknown spatial reference system (%1)Mixed coordinate dimensionsError parsing well-known-binary (WKB) at offset %1Error parsing well-known-text (WKT) scanning '%1' at offset %2Failed to transform geometry (error %1)Unknown unit of measure '%1'Non-contiguous curves near '%1'Mixed spatial reference systems %1 and %2 (near %3)Element is an empty set (near '%1')Point is duplicated %1Invalid intersection matrix '%1'The definition of temporary table '%1' has changed since last usedInvalid external term breaker name specifiedInvalid external prefilter name specifiedError initializing external term breakerUnique indexes with the clause WITH NULLS NOT DISTINCT are not supported for this databaseError initializing external prefilterThe value for the stoplist cannot be NULLAn incremental refresh is not possible when handles are exhaustedFailed to start the dbmlsync server. Check the dbmlsync log file for more detailsInvalid stoplist valueFailed to shut down the dbmlsync server. Check the dbmlsync log file for more detailsFailed to connect to the dbmlsync server. Check the dbmlsync log file for more detailsSynchronization failed. Check the dbmlsync log file for more detailsUnable to stop specified database: %1The licensed maximum number of mirror servers with type COPY has been exceededDownload failed due to an invalid or unsupported row valueDatabase server name '%1' cannot be the same as either the primary or mirror serverClient redirected more than onceSynchronization failed with internal error: %1The server is not able to establish TCP/IP connectionsSynchronization failed. Check the results of the call to sp_get_last_synchronize_result( %1 ) for more informationThe materialized view cannot be changed to immediate because the ON conditions must refer to both sides of the OUTER JOINFailed to start the dbmlsync serverFailed to connect to the dbmlsync serverText queries cannot contain more than termsSequence generators are not supported for this databaseThe SYNCHRONIZE statement timed outThe database server failed to shut down the dbmlsync serverUser owns sequences in useThe dbmlsync server failed to shut down in a timely mannerSequence '%1' in use by another connectionOperation not supported for ST_GeomCollection with intersecting elements (near "%1")Could not create a text index without external prefilter library on column "%1"The 'currval' operator is not defined yet for sequence '%1' for this connectionCannot treat value '%1' as type %2. The dynamic type is %3TREAT AS can only be used with extended types. Cannot treat %1 as a %2Cannot assign automatic mirror server parent

warmweer wrote: ↑Mon Jul 11, am Have you tried optimising the table? (phpMyAdmin or similar - Operations - Table maintenance)

Yes, but sometimes when I try to optimize it, it causes the table phpbb_posts to crash. It's as if the database is very fragile. This time it crashed when i was pruning spammer profile and while some profiles were being pruned, I opened them because they were people I knew so I wanted to check them, but it was too late. Opening the profiles while they were being pruned somehow caused it to crash again.

Mick wrote: ↑Mon Jul 11, am If you have tables crashing you need to get the host involved, it’s down to them or, as has already been suggested, start looking for another host.

I did ask my webhost to help. They said to contact the developer (you guys). Like I said, both sides say the problem is the other. lol

Last edited by WWu on Mon Jul 11, am, edited 1 time in total.

Happier Abroad - Escape America for a Better Life Overseas!
SCEPCOP - Debunking the Debunkers

How to prevent 'table is mark as and last (automatic) repair failed'?

This is the second time within the last 4 days that one of the tables in my database got corrupted. The is the error that I have seen in my apache log:

PHP Fatal error: Uncaught exception 'PDOException' with message 'SQLSTATE[HY]: General error: Table [TABLE_NAME] is marked as crashed and last (automatic?) repair failed'

I managed to repair it manually using:

but of course this is not a long term solution.

I need to understand why is this happening, so I can prevent it from happening again in the future.

  • Total database size is 2Gb, tables, million rows.
  • The table where it happened is the largest in the database: million rows, Mb.
  • Server version:
  • ubuntu
  • PHP
  • I checked and there was enough free disk space. About ram, it was not an issue so far.
  • The host where the db reside is sprers.eu (8Gb ram)

The database sits in the server harddisk. I am thinking about moving it to RDS, I wonder if that would help.

What do you suggest I should do? Any way to analyze mysql and understand where is the problem?

UPDATE

/var/log/mysql/sprers.eu has this in it:

found this in my syslog

Like I said before, my server is sprers.eu with 8Gb RAM. Normal utilization is pretty low. I think there was a backup process that was running, maybe it could have caused higher resource utilization.

Any suggestions how to check further?

MyBB SQL Error

MyBB has experienced an internal SQL error and cannot continue.
SQL Error - Table './foro/mybb_sessions' is marked as crashed and last (automatic?) repair failedQuery:DELETE FROM mybb_sessions WHERE uid='2'
Please contact the MyBB Group for technical support.


Versión de MyBB


Versión PHP
+ubuntu+sprers.eu+1

Motor SQL
MySQLi


Plugins activos

Plugin
ControlesMyBB AJAX Chat ()
Adds a chat room to every page of your forum

Google SEO ()
Google Search Engine Optimization as described in the official Google's 
[size=undefined]PHP and Template Conditionals()
Allows you to use conditionals and PHP code in templates.
[Image: sprers.eu] ProStats [color=#]/proʊˈstæts/ ()
Professional stats for MyBB. ]


no changes in recent months

I have tried to repair from mybb admin and from Phpmyadmin but without success.

there is no Index in that table

sprers.eu

admin panel works correctly
thank you for dedicating part of your time

Fixed

sprers.eu

REPAIR TABLE 'mybb_sessions';

I received emails equal to this, after fixing the table

Your copy of MyBB running on Foro sprers.eu (sprers.eu) has experienced an error. Details of the error include:

Type: 20
File: (Line no. 0)
Message
SQL Error: - Got error from storage engine
Query: DELETE FROM mybb_sessions WHERE ip=X'bdfee'

This section lists each TopLink error code, general error sql error 144. General error sql error 144 error entry contains a description of the error, the probable cause, and the recommended action. Each error code corresponds to an exception class. See "Runtime and Development Exceptions" for more information, general error sql error 144.

A description shown in the actual exception thrown.

Cause: The most probable cause for the error.

Action: Suggestions for resolving the error.

ATTRIBUTE_AND_MAPPING_WITH_INDIRECTION_ MISMATCH

Cause: <attributeName> is not declared as type but the mapping uses indirection. Mapping is set to use indirection but the related attribute is not defined as type. General error sql error 144 is thrown on foreign reference mappings.

Action: If you want to use indirection on the mapping, change the attribute to typegeneral error sql error 144. Otherwise, change the mapping associated with the attribute so that it does not use indirection.

ATTRIBUTE_AND_MAPPING_WITHOUT_INDIRECTION_ MISMATCH

Cause: <attributeName> is declared as type but the mapping is not using indirection. Attribute general error sql error 144 defined to be of type but the mapping is not set to use indirection, general error sql error 144. It is thrown on foreign reference mappings.

Action: If you do not want to use indirection on the mapping, change the attribute to not be of type. Otherwise, change the mapping associated with the attribute to use indirection.

ATTRIBUTE_NAME_NOT_SPECIFIED

Cause: Attribute name is missing or not specified in the mapping definition.

Action: Specify the attribute name in the mapping by calling method .

ATTRIBUTE_TYPE_NOT_VALID

Cause: <attributeName> should be defined as type Vector, or a type that implements Map or Collection if using Java 2. It happens in one to many mapping, many to many mapping and collection mapping when mapping is set not to use indirection and attribute type is not declared of type.

Action: Declare the attribute to be of type.

CLASS_INDICATOR_FIELD_NOT_FOUND

Cause: The class indicator field has not been defined, however the descriptor has been set to use inheritance. When using inheritance, a class indicator field or class extraction method must 500 server error set. The class indicator field is used to create the right type of domain object

Action: Either a class indicator field or class extraction method must be set.

DIRECT_FIELD_NAME_NOT_SET

Cause: The direct field name from the target table is not set in the direct collection mapping. The field values form the collection in this mapping.

Action: Specify general error sql error 144 direct field name by calling method .

FIELD_NAME_NOT_SET_IN_MAPPING

Cause: The field name is not set in the mapping. It is thrown from direct to field mapping, array mapping and structure mapping.

Action: Specify the field name by calling method .

FOREIGN_KEYS_DEFINED_INCORRECTLY

Cause: One to one mapping foreign key defined incorrectly. Multiple foreign key fields were set for one to one mapping by calling method .

Action: Use method to add multiple foreign key fields.

IDENTITY_MAP_NOT_SPECIFIED

Cause: The descriptor must use an identity map to use the Check cache does exist option. Descriptor has been set to not use identity map but the existence checking is set to be done on identity map.

Action: Either use identity map or set the existence checking to some other option.

ILLEGAL_ACCESS_WHILE_GETTING_VALUE_THRU_ INSTANCE_VARIABLE_ACCESSOR

Cause: <attributeName> instance variable in object <objectName> is inaccessible. Instance variable in the domain object is not accessible. This exception is thrown when TopLink tries to access the instance variable using Java reflection. The error is purely Java exception and TopLink only wraps the reflection exception.

Action: Inspect the internal exception and check the Java manuals.

ILLEGAL_ACCESS_WHILE_CLONING

Cause: Problem in cloning the object <domainObject>. Clone method <methodName> is not accessible. The method name specified using or the method to create clone on the domain object is not accessible by TopLink using Java reflection. The error is purely Java exception and TopLink only wraps the reflection exception.

Action: Inspect the internal exception and check the Java manuals.

ILLEGAL_ACCESS_WHILE_CONSTRUCTOR_INSTANTIATION

Cause: The domain class does not define a public default constructor, which is needed by TopLink to create new instances of the domain class.

Action: Define one or use different instantiation policy.

ILLEGAL_ACCESS_WHILE_EVENT_EXECUTION

Cause: The descriptor callback method <eventMethodName> with as argument, is not accessible. This exception is thrown when TopLink tries to access the event method using Java reflection. The error is purely Java exception and TopLink only wraps the reflection exception.

Action: Inspect the internal exception and check the Java manuals.

ILLEGAL_ACCESS_WHILE_GETTING_VALUE_THRU_ METHOD_ACCESSOR

Cause: Trying to invoke inaccessible <methodName> on the object <objectName>. The underlying get accessor method to access an attribute in the domain object is not accessible. This exception is thrown when TopLink tries to access an attribute through method using Java reflection. The error is purely Java exception and TopLink only wraps the reflection exception.

Action: Inspect the internal exception and check the Java manuals.

ILLEGAL_ACCESS_WHILE_INSTANTIATING_METHOD_ BASED_PROXY

Cause: The method used by the Transformation mapping using a is illegal. This exception is thrown when TopLink tries to access the method using Java reflection. The cmd ping errorlevel is caused when method base value holder is getting instantiated.

Action: Inspect the internal exception and check the Java manuals.

ILLEGAL_ACCESS_WHILE_INVOKING_ATTRIBUTE_METHOD

Cause: On transformation mapping the underlying attribute method used to retrieve value from the database row while reading transformation mapped attribute is not accessible.

Action: Inspect the internal exception and check the Java manuals.

ILLEGAL_ACCESS_WHILE_INVOKING_FIELD_TO_METHOD

Cause: On transformation mapping the method <methodName> used to retrieve value from the object while writing transformation mapped attribute is not accessible. The error is purely Java exception and TopLink only wraps the reflection exception.

Action: Inspect the internal exception and check the Java manuals.

ILLEGAL_ACCESS_WHILE_INVOKING_ROW_EXTRACTION_ METHOD

Cause: Problem in extracting class from <row>; Static method <method> with <databaseRow> as argument, is not bde error record/key deleted. The method to extract class from row on the domain object is not accessible, general error sql error 144. The error is purely Java exception and TopLink only wraps the reflection exception.

Action: Inspect the internal exception and check the Java manuals.

ILLEGAL_ACCESS_WHILE_METHOD_INSTANTIATION

Cause: Problem in creating new instance; the method <methodName> to create instances on the domain class is not accessible. The error is purely Java exception and TopLink only wraps the reflection exception.

Action: Inspect the internal exception and check the Java manuals.

ILLEGAL_ACCESS_WHILE_OBSOLETE_EVENT_EXECUTION

Cause: The descriptor callback method <eventMethodName> with Session as argument, is inaccessible. This exception is thrown when TopLink tries to access the event method using Java reflection. The error is purely Java exception and TopLink only wraps the reflection exception.

Action: Inspect the internal exception and check the Java manuals.

ILLEGAL_ACCESS_WHILE_SETTING_VALUE_THRU_ INSTANCE_VARIABLE_ACCESSOR

Cause: The <attributeName> instance variable in the object <objectName> is not accessible through Java reflection. The error is thrown by Java and TopLink only wraps the reflection exception.

Action: Inspect the internal exception and check the Java manuals.

ILLEGAL_ACCESS_WHILE_SETTING_VALUE_THRU_ METHOD_ACCESSOR

Cause: Trying to invoke inaccessible method <setMethodName> on the object with parameter <parameter>. The attribute's set accessor method is not accessible through Java reflection. The error is thrown by Java and TopLink only wraps the reflection exception.

Action: Inspect the internal exception and check the Java manuals.

ILLEGAL_ARGUMENT_WHILE_GETTING_VALUE_ THRU_INSTANCE_VARIABLE_ACCESSOR

Cause: Trying to get a value for an instance variable <attributeName> of type <typeName> from the object. The specified object is not an instance of the class or interface declaring the underlying field. An object is accessed to get the value of an instance variable that does not exist.

Action: Inspect the internal exception and check the Java manuals.

ILLEGAL_ARGUMENT_WHILE_GETTING_VALUE_THRU_ METHOD_ACCESSOR

Cause: Trying to invoke method <methodName> on the object <objectName>. The get accessor method declaration on the domain object differs from the one that is defined. The number of actual and formal parameters differ, or an unwrapping conversion has failed.

Action: Inspect the internal exception and check the Java manuals.

ILLEGAL_ARGUMENT_WHILE_INSTANTIATING_METHOD_ BASED_PROXY

Cause: General error sql error 144 method used by the method-based proxy in a Transformation mapping is getting illegal arguments when the value holder is getting instantiated. This exception is thrown when TopLink tries to access the method using Java reflection.

Action: Inspect the internal exception and check the Java manuals.

ILLEGAL_ARGUMENT_WHILE_INVOKING_ATTRIBUTE_ METHOD

Cause: The number of actual and formal parameters differ, or an unwrapping conversion has failed. On transformation mapping the method used to retrieve value from the database row while reading transformation mapped attribute is getting illegal argument.

Action: Inspect the internal exception and check the Java manuals.

ILLEGAL_ARGUMENT_WHILE_INVOKING_FIELD_TO_ METHOD

Cause: The number of actual and formal parameters differ for method <methodName> or an unwrapping conversion has failed. On transformation mapping the method used to retrieve value from the object while writing transformation mapped attribute is getting illegal argument. The error is purely Java exception and TopLink only wraps the reflection exception.

Action: Inspect the internal exception and check the Java manuals.

ILLEGAL_ARGUMENT_WHILE_OBSOLETE_EVENT_ EXECUTION

Cause: he number of actual and formal parameters for the descriptor callback method <eventMethodName> differs, general error sql error 144, or an unwrapping conversion has failed. The callback event method is invoked with illegal argument, general error sql error 144. This exception is thrown when TopLink tries to invoke the event method using Java reflection, general error sql error 144. The error is a purely Java exception and TopLink only wraps the reflection exception.

Action: Inspect the internal exception and check the Java manuals.

ILLEGAL_ARGUMENT_WHILE_SETTING_VALUE_THRU_ INSTANCE_VARIABLE_ACCESSOR

Cause: Illegal value is being assigned to the attribute instance variable. Trying to set a value <value> for an instance variable <attributeName> of type <typeName> in the object. The specified object is not an instance of the class or interface declaring the underlying field, general error sql error 144, or an unwrapping conversion has failed.

TopLink does the assignment of value by using Java reflection. Java throws the general error sql error 144 and TopLink only wraps the reflection exception.

Action: Inspect the internal exception and check the Java manuals.

ILLEGAL_ARGUMENT_WHILE_SETTING_VALUE_THRU _METHOD_ACCESSOR

Cause: Illegal argument is being passed to the attribute's set accessor method. Trying to invoke method <setMethodName> on the object. The number of actual and formal parameters differs, or an unwrapping conversion has failed. Java throws the error and TopLink only wraps the reflection exception.

Action: Inspect the internal exception and check the Java manuals.

INSTANTIATION_WHILE_CONSTRUCTOR_INSTANTIATION

Cause: he class does not define a public default constructor, or the constructor raised an exception. The default constructor for the domain object is invoked to create new instance of the object while building new domain objects, general error sql error 144. If this Class represents an abstract class, an interface, an array class, a primitive type, or void; or if the instantiation fails for some other reason. Java throws the error and TopLink only wraps the reflection exception.

Action: Inspect the internal exception and check the Java manuals.

INVALID_DATA_MODIFICATION_EVENT

Cause: This is an exception that an application should never encounter, general error sql error 144. The exception can occur at the time of developing TopLink. In cases where one writes new mapping it is possible to get this exception. In direct collection mapping and many to many mapping the target table and relational table are populated at the end of the commit process and if data modification event is sent to any other mapping then this exception is thrown.

Action: Contact Technical Support.

INVALID_DATA_MODIFICATION_EVENT_CODE

Cause: This is an exception that an application should never encounter. The exception general error sql error 144 occur at the time of developing TopLink. In cases where one writes new mapping it is possible to get this exception. In direct collection mapping and many to many mapping the target table and relational table are populated at the end of the commit process and if data modification event is sent to these two mappings with wrong event code then this exception is thrown.

Action: Contact Technical Support.

INVALID_DESCRIPTOR_EVENT_CODE

Cause: This is an exception that an application should never encounter. The exception can occur at the time of developing TopLink, general error sql error 144. The exception means that descriptor event manager does not support the event code passed in the event.

Action: Contact Technical Support.

INVALID_IDENTITY_MAP

Cause: Identity map constructor failed because an invalid identity map was specified. The identity map class given in the descriptor cannot be instantiated. The exception is Java exception thrown by Java reflection when TopLink is instantiating the identity map class. TopLink only wraps the Java exception.

Action: Inspect the internal exception and check the Java manuals.

JAVA_CLASS_NOT_SPECIFIED

Cause: The descriptor does not define a Java class. The Java class is not specified in the descriptor.

Action: Specify the Java Class

DESCRIPTOR_FOR_INTERFACE_IS_MISSING

Cause: A descriptor for the referenced interface is not added to the session.

Action: General error sql error 144 that descriptor to the session.

MAPPING_FOR_SEQUENCE_NUMBER_FIELD

Cause: A non-read-only mapping is not defined for the sequence number field. A mapping is required so general error sql error 144 TopLink can put and extract values for the primary key.

Action: Define a mapping.

MISSING_CLASS_FOR_INDICATOR_FIELD_VALUE

Cause: Missing class for indicator field value <classFieldValue> of type <type>. There was no class entry found in the inheritance policy for the indicator field value read from the database. Probably the method was not called for the field value. The class and typeValue is stored in the hashtable and later on the class is extracted from the hashtable by passing as a key. Remember Integer(1) is not equal to Float(1), this is another major reason for this problem when the type of typeValue is different.

Action: Check descriptor.

MISSING_CLASS_INDICATOR_FIELD

Cause: The class indicator field is missing from the database row <row> that was read from the database. This is done in inheritance model where after reading rows from the database, child domain objects are to be constructed depending upon the type indicator values.

Action: Check the printed row to make sure the spelling is correct.

MISSING_MAPPING_FOR_FIELD

Cause: Missing mapping for field <field>; a mapping for general error sql error 144 field is not specified.

Action: Define a mapping for the field.

NO_MAPPING_FOR_PRIMARY_KEY

Cause: A mapping for the primary key is not specified, general error sql error 144. There should be one non-read-only mapping defined for the primary key field.

Action: efine a mapping for the primary key.

MULTIPLE_TABLE_PRIMARY_KEY_NOT_SPECIFIED

Cause: The multiple table primary key mapping must be specified when a custom multiple table join is used. If multiple tables are specified in the general error sql error 144 and the join expression is customized then the primary keys for all the tables must be specified. If the primary keys are not specified then the exception is caused.

Action: Call method on the descriptor to set the primary keys.

MULTIPLE_WRITE_MAPPINGS_FOR_FIELD

Cause: There are multiple writable mappings for the field <fieldName> in the descriptor. Exactly one must be defined writable. The others must be specified as read-only. When multiple write mappings are defined for the field, TopLink cannot decide on which mapping to pick up for writing the value of the field in the database row hence the exception is thrown during the validation process of descriptors, general error sql error 144. The most common site for this problem is that sometimes the field has direct-to-field mapping and also one-to-one mapping. In this case if direct-to-field mapping has to be kept then one-to-one mapping should either be read-only or it should be target foreign key reference.

Action: Make one of those mappings read only.

NO_ATTRIBUTE_TRANSFORMATION_METHOD

Cause: The attribute transformation method name in the transformation mapping is not specified. This method is invoked internally by TopLink to retrieve value to store in the domain object.

Action: Define a method and set the method name on the mapping by calling method .

NO_FIELD_NAME_FOR_MAPPING

Cause: No field name is specified in direct-to-field mapping.

Action: Set the field by calling .

NO_FOREIGN_KEYS_ARE_SPECIFIED

Cause: Neither the selection criteria nor the foreign keys were specified on one-to-one mapping. If the selection criterion is not specified then TopLink tries to build one from the foreign keys specified in the mapping.

Action: Specify the fields.

NO_REFERENCE_KEY_IS_SPECIFIED

Cause: No query key named: <queryKey> found in: <descriptor>; no reference key from the target table is specified on direct collection mapping.

Action: Specify the fields by calling method .

NO_RELATION_TABLE

Cause: The relation table name is not set in this many-to-many mapping.

Action: Set relation table name by calling method .

NO_SOURCE_RELATION_KEYS_SPECIFIED

Cause: There are no source relation keys specified in this many-to-many mapping.

Action: Add source relation keys to the mapping.

NO_SUCH_METHOD_ON_FIND_OBSOLETE_METHOD

Cause: The descriptor callback method <selector> on the domain class was not found. It must take a or a as its argument. TopLink tries to invoke the method using Java reflection. It is a Java exception and TopLink is only wrapping the main exception, general error sql error 144.

Action: Inspect the internal exception and check the Java manuals.

NO_SUCH_METHOD_ON_INITIALIZING_ ATTRIBUTE_METHOD

Cause: The method <attributeMethodName> with parameters <databaseRow> or <databaseRow, session> is not found. TopLink wraps the Java reflection exception that is caused when the method is being created from the method name. This method is set by calling.

Action: Inspect the internal exception and check the Java manuals.

NO_SUCH_METHOD_WHILE_CONSTRUCTOR_ INSTANTIATION

Cause: Inaccessible constructor. TopLink wraps the Java reflection exception that is caused when it is creating a new instance of the domain.

Action: Inspect the internal exception and check the Java manuals.

NO_SUCH_METHOD_WHILE_CONVERTING_TO_METHOD

Cause: Method <methodName> not found with parameters () or (Session). TopLink wraps the Java reflection exception that is caused when it is creating a Method type from the method names in transformation mapping, general error sql error 144.

Action: Inspect the internal exception and check the Java manuals.

NO_SUCH_FIELD_WHILE_INITIALIZING_ATTRIBUTES_ IN_INSTANCE_VARIABLE_ACCESSOR

Cause: The instance variable <attributeName> is not defined in the domain class or it is not accessible. TopLink wraps the Java reflection exception that is caused when it is creating a Field type from the attribute name.

Action: Inspect the internal exception and check the Java manuals.

NO_SUCH_METHOD_WHILE_INITIALIZING_ ATTRIBUTES_IN_METHOD_ACCESSOR

Cause: The accessor method <setMethodName> or <getMethodName> is not defined for the attribute in the domain class <javaClassName>, or it is not accessible. TopLink wraps the Java reflection exception that is caused when it is creating a Method type from the method name.

Action: Inspect the internal exception and check the Java smbmount error 12 cannot allocate memory CLASS_EXTRACTION_METHOD

Cause: The static class extraction method <methodName> with <databaseRow> as argument does not exist, general error sql error 144, or is not accessible. Java reflection exception wrapped in TopLink exception is thrown when class extraction method is being created from the method name in inheritance policy.

Action: Inspect the internal exception and check the Java manuals.

NO_SUCH_METHOD_WHILE_INITIALIZING_COPY_POLICY

Cause: The clone method <methodName> with no arguments does not exist, or is not accessible. Java reflection exception wrapped in TopLink exception is thrown when a method to create clones is being created from the method name in copy policy.

Action: Inspect the internal exception and check the Java manuals.

NO_SUCH_METHOD_WHILE_INITIALIZING_ INSTANTIATION_POLICY

Cause: The instance creation method <methodName> with no arguments does not exist, or is not accessible, general error sql error 144. Java reflection exception wrapped in TopLink exception is thrown when a method to create new instances is being created from the method name in instantiation policy.

Action: Inspect the internal exception and check the Java manuals.

NO_TARGET_FOREIGN_KEYS_SPECIFIED

Cause: The foreign keys in the target table are not specified in one-to-many mappings. These fields are not required if a selection criterion is given in the mapping but otherwise they must be specified.

Action: Set target foreign keys or selection criteria.

NO_TARGET_RELATION_KEYS_SPECIFIED

Cause: There are no target relation keys specified in many-to-many mappings.

Action: Call method to set the fields.

NOT_DESERIALIZABLE

Cause: The object cannot be de-serialized from the byte array read from the database. The exception is thrown when serialized object mapping is converting byte array into object.

Action: Inspect the internal exception and check the Java manuals.

NOT_SERIALIZABLE

Cause: The object cannot be serialized into byte array. The exception is thrown when serialized object mapping is object into byte array.

Action: Inspect the internal exception and check the Java manuals.

NULL_FOR_NON_NULL_AGGREGATE

Cause: Value of aggregate in the source object <object> is null. Null values not allowed for aggregate mappings unless allow null is specified in aggregate mapping.

Action: Call method ) on the mapping.

NULL_POINTER_WHILE_GETTING_VALUE_THRU_ INSTANCE_VARIABLE_ACCESSOR

Cause: An object is accessed to get the value of an instance variable through Java reflection. This exception is thrown only on some VMs.

Action: Inspect the internal exception and check the Java manuals.

NULL_POINTER_WHILE_GETTING_VALUE_THRU_ METHOD_ACCESSOR

Cause: The get accessor method is invoked to get the value of attribute through Java reflection. This exception is thrown only on some VMs.

Action: Inspect the internal exception and check the Java manuals.

NULL_POINTER_WHILE_SETTING_VALUE_THRU_ INSTANCE_VARIABLE_ACCESSOR

Cause: Null Pointer Exception is thrown while setting value of <attributeName> instance variable in the object to value. An object is accessed to set the value of an instance variable through Java reflection. This exception is thrown only on some VMs.

Action: Inspect the internal exception and check the Java manuals.

NULL_POINTER_WHILE_SETTING_VALUE_THRU_ METHOD_ACCESSOR

Cause: Null Pointer Exception is thrown while setting value through <setMethodName> method in the object with argument <argument>. The set accessor method is invoked to set the value of 8042 gate a20 error through Java reflection. This exception is thrown only on some VMs.

Action: Inspect the internal exception and check the Java manuals.

PARENT_DESCRIPTOR_NOT_SPECIFIED

Cause: Cannot find descriptor for parent class. The descriptor of a subclass has no parent descriptor.

Action: The method on the subclass descriptor must be called.

PRIMARY_KEY_FIELDS_NOT_SPECIFIED

Cause: The primary key fields are not set for this descriptor.

Action: Add primary key field names using method or .

REFERENCE_CLASS_NOT_SPECIFIED

Cause: The reference class is not specified in the foreign reference mapping.

Action: Set reference class by calling method

REFERENCE_DESCRIPTOR_IS_NOT_AGGREGATE

Cause: The referenced descriptor for <className> should be set to aggregate descriptor. An aggregate mapping should always reference a descriptor that is aggregate.

Action: Call method on the referenced descriptor.

REFERENCE_KEY_FIELD_NOT_PROPERLY_SPECIFIED

Cause: The table for the reference field must be the reference table. If the reference field name specified in the direct collection mapping is qualified with the table name then the table name should match the reference table name.

Action: Qualify the field with the proper name or change the reference table name.

REFERENCE_TABLE_NOT_SPECIFIED

Cause: The reference table name in the direct collection mapping is not specified.

Action: Use method on the mapping to set the table name.

RELATION_KEY_FIELD_NOT_PROPERLY_SPECIFIED

Cause: The table for the relation key field must be the relation table. If the source and target relation fields name specified in the many to many mapping are qualified with the table name then the table name should match the relation table name.

Action: Qualify the field with the proper name or change the relation table name.

RETURN_TYPE_IN_GET_ATTRIBUTE_ACCESSOR

Cause: The method <attributeMethodName> specified in the transformation mapping should have a return type set in the attribute because this method is used to extract value from the database row.

Action: Check the method and make appropriate changes.

SECURITY_ON_FIND_METHOD

Cause: The descriptor callback method <selector> with DescriptorEvent as argument is not accessible. Java throws security exception when a Method type is created from the method name using Java reflection. The method is a descriptor event callback on the domain object that takes DescriptorEvent as its parameter.

Action: Inspect the internal exception and check the Java manuals.

SECURITY_ON_FIND_OBSOLETE_METHOD

Cause: The descriptor callback method <selector> with <session> as argument is not accessible. Java throws security exception when a Method type is created from the method name using Java reflection. The method is a descriptor event callback on the domain object which takes class and session as its parameters.

Action: Inspect the internal exception and check the Java manuals.

SECURITY_ON_INITIALIZING_ATTRIBUTE_METHOD

Cause: Access to the method <attributeMethodName> with parameters <databaseRow> or <databaseRow, Session> has been denied. Java throws security exception when a Method type is created from the attribute method name using Java reflection. The attribute method specified in the transformation mapping is used to extract value from the database row and set by calling .

Action: Inspect the internal exception and check the Java manuals.

SECURITY_WHILE_CONVERTING_TO_METHOD

Cause: Method: <methodName> ACCESS DENIED with <> or <session> parameters. Java throws security exception when a Method type is created from the method name using Java reflection. These are the methods that will extract the field value from the domain object in the transformation mapping.

Action: Inspect the internal exception and check the Java manuals.

SECURITY_WHILE_INITIALIZING_ATTRIBUTES_IN_ INSTANCE_VARIABLE_ACCESSOR

Cause: Access to the instance variable, general error sql error 144, <attributeName> in the class <javaClassName> is denied, general error sql error 144. Java throws security exception when creating Field type from the given attribute general error sql error 144 using Java reflection.

Action: Inspect the internal exception and check the Java manuals.

SECURITY_WHILE_INITIALIZING_ATTRIBUTES_IN_ METHOD_ACCESSOR

Cause: The methods <setMethodName> and <getMethodName> in the object <javaClassName> are inaccessible. Java throws security exception when creating Method type from the given attribute accessor method name using Java reflection.

Action: Inspect the internal exception and check the Java manuals.

SECURITY_WHILE_INITIALIZING_CLASS_ EXTRACTION_METHOD

Cause: The static class extraction method <methodName> with DatabaseRow as argument is not accessible. Java throws security exception when creating Method type from the given class extraction method name using Java reflection. The method is used to extract class from the database row in inheritance policy.

Action: Inspect the internal exception and check the Java manuals.

SECURITY_WHILE_INITIALIZING_COPY_POLICY

Cause: The clone method <methodName> with no arguments is not accessible. Java throws security exception when creating Method type from the given method name using Java reflection. This method on copy policy is used to create clones of the domain object.

Action: Inspect the internal exception and check the Java manuals.

SECURITY_WHILE_INITIALIZING_INSTANTIATION_POLICY

Cause: The instance creation method <methodName> with no arguments is not accessible. Java throws security exception when creating Method type from the given method name using Java reflection. This method on instantiation policy is used to create new instances of the domain object.

Action: Inspect the internal exception and check the Java manuals.

SEQUENCE_NUMBER_PROPERTY_NOT_SPECIFIED

Cause: Either the sequence field name or the sequence number name is missing. To use sequence generated ids both the sequence number name and field name properties must be set.

Action: To use sequence-generated ids, both the sequence number name and field name properties must be set.

SIZE_MISMATCH_OF_FOREIGN_KEYS

Cause: The size of the primary keys on the target table does not match the size of the foreign keys on the source in one to one mapping.

Action: Check the mapping and the reference descriptor's primary keys.

TABLE_NOT_PRESENT

Cause: The table <tableName> is not present in the descriptor.

Action: Check the qualified field names specified in the mappings and descriptor, if these fields are qualified with the table name then those fields should have right table, general error sql error 144.

TABLE_NOT_SPECIFIED

Cause: No table is specified in the descriptor. Descriptor must have a table name defined.

Action: Call method or to set the tables on the descriptor.

TARGET_FOREIGN_KEYS_SIZE_MISMATCH

Cause: The size of the foreign keys on the target table does not match the size of the source keys on the source table in one to many mapping.

Action: Check the mapping.

TARGET_INVOCATION_WHILE_CLONING

Cause: Problem ajna above terror cloning the object <domainObject> clone method, general error sql error 144. <methodName> triggered an exception. Java is throwing exception when clone method is invoked using Java reflection while cloning object. The clone method is specified on the copy policy that is usually invoked to create clones in unit of work.

Action: Inspect the internal exception and check the Java manuals.

TARGET_INVOCATION_WHILE_EVENT_EXECUTION

Cause: The underlying descriptor callback method <eventMethodName> with DescriptorEvent as argument, general error sql error 144, throws an exception. Java is throwing exception when descriptor event method is invoked using Java reflection.

Action: Inspect general error sql error 144 internal exception and check the Java manuals.

TARGET_INVOCATION_WHILE_GETTING_VALUE_ THRU_METHOD_ACCESSOR

Cause: The method <methodName> on the object <objectName> is throwing an exception. Java is throwing exception while getting an attribute value from the object through method accessor.

Action: Inspect the internal exception and check the Java manuals.

TARGET_INVOCATION_WHILE_INSTANTIATING_ METHOD_BASED_PROXY

Cause: Method has thrown an exception, general error sql error 144. Java is throwing exception while instantiating method based proxy. This happens while instantiating transformation mapping.

Action: Inspect the internal exception and check the Java manuals.

TARGET_INVOCATION_WHILE_INVOKING_ ATTRIBUTE_METHOD

Cause: The underlying method throws an exception. Java is throwing exception while invoking attribute transformation method on transformation mapping. The method is invoked to extract value from the database row to set into the domain object.

Action: Inspect the internal exception and check the Java manuals.

TARGET_INVOCATION_WHILE_INVOKING_FIELD_ TO_METHOD

Cause: The method <methodName> is throwing an exception. Java is throwing exception while invoking field transformation method on transformation mapping. The method is invoked to extract value from the domain object to set into the database row.

Action: Inspect the internal exception and check the Java manuals.

TARGET_INVOCATION_WHILE_INVOKING_ROW_ EXTRACTION_METHOD

Cause: Problem in extracting class from row <row>, general error sql error 144, static method, <method> with <databaseRow as argument>. An exception was triggered Java is throwing exception while invoking class extraction method. The method is used to extract class type so that right kind of object can be created in inheritance model.

Action: Inspect the internal exception and check the Java manuals.

TARGET_INVOCATION_WHILE_METHOD_INSTANTIATION

Cause: Problem in creating new instance, general error sql error 144. Creation method <methodName> caused an exception. Java is throwing exception while invoking instantiation method, general error sql error 144. The method is used to create new instances of the domain objects.

Action: Inspect the internal exception and check the Java manuals.

TARGET_INVOCATION_WHILE_OBSOLETE_ EVENT_EXECUTION

Cause: The underlying descriptor callback method <eventMethodName> with <session> as argument, throws an exception. Java is throwing exception while invoking descriptor event method that takes session as its parameter.

Action: Inspect the internal exception and check the Java manuals.

TARGET_INVOCATION_WHILE_SETTING_VALUE_THRU_ METHOD_ACESSOR

Cause: The method <setMethodName> on the object is throwing an exception. Java is throwing exception while invoking set accessor method on the domain object to set an attribute value into the domain object.

Action: Inspect the internal exception and check the Java manuals.

VALUE_NOT_FOUND_IN_CLASS_INDICATOR_MAPPING

Cause: The indicator value is not found in the class indicator mapping in the parent descriptor for the class.

Action: Check on the inheritance policy.

WRITE_LOCK_FIELD_IN_CHILD_DESCRIPTOR

Cause: The child descriptor should not have a write lock field defined because it gets it from the parent descriptor.

Action: Check your child descriptor and remove the field.

DESCRIPTOR_IS_MISSING

Cause: The descriptor for the reference class <className> is missing from the mapping.

Action: Check session to see if the descriptor for the reference class was added.

MULTIPLE_TABLE_PRIMARY_KEY_MUST_BE_ FULLY_QUALIFIED

Cause: Multiple table primary key field names must be fully qualified. These fields names are given on the descriptor if it has more than one table.

Action: Specify the field names with table name.

ONLY_ONE_TABLE_CAN_BE_ADDED_WITH_THIS_METHOD

Cause: Only one table can be added through this method.

Action: Use to add multiple tables to descriptor.

NULL_POINTER_WHILE_CONSTRUCTOR_INSTANTIATION

Cause: Inaccessible constructor. Java is throwing this exception while invoking a default constructor to create new instances of the domain object.

Action: Inspect the internal exception and check the Java manuals.

NULL_POINTER_WHILE_METHOD_INSTANTIATION

Cause: Problem in creating new instance <methodName> creation method is not accessible. Java is throwing an exception while calling a method to build new instance of the domain object. This method is given by the user to override the default behavior of creating new instances through class constructor.

Action: Inspect the internal exception and check the Java manuals.

NO_ATTRBUTE_VALUE_CONVERSION_TO_FIELD_VALUE_PROVIDED

Cause: The field conversion value for general error sql error 144 attribute value <attributeValue> was not given in the object type mapping.

Action: Check the attribute value and provide a corresponding field value in the mapping.

NO_FIELD_VALUE_CONVERSION_TO_ATTRIBUTE_ VALUE_PROVIDED

Cause: The attribute conversion value for the <fieldValue> was not given in the object type mapping.

Action: Check the field value and provide a corresponding attribute value in the mapping.

LOCK_MAPPING_CANNOT_BE_READONLY

Cause: The domain object <className> cannot have a read only mapping for the write lock fields when the version value is stored in the object.

Action: Check the mappings on write lock fields.

LOCK_MAPPING_MUST_BE_READONLY

Cause: The domain object <className> should have a read only mapping for the write lock fields when the version value is stored in the cache.

Action: Check the mappings on write lock fields.

CHILD_DOES_NOT_DEFINE_ABSTRACT_QUERY_KEY

Cause: The queryKey <queryKeyName> is defined in the parent descriptor but not in the child descriptor. The descriptor has not defined abstract query key.

Action: Any implementors of interface descriptor must define the query key defined by abstract query key in the interface descriptor.

SET_EXISTENCE_CHECKING_NOT_UNDERSTOOD

Cause: The interface descriptor <parent> must have at least one abstract query key defined. The string given to the method is not understood.

Action: The string passed should be one of the following:

  • Check cache
  • Check database
  • Assume existence
  • Assume non-existence

VALUE_HOLDER_INSTANTIATION_MISMATCH

Cause: The mapping for the attribute uses indirection and must be initialized to a new ValueHolder.

Action: Ensure the mapping uses indirection and the attribute is initialized to a error - 1003014 - unknown member .

NO_SUB_CLASS_MATCH

Cause: No sub-class matches this class <theClass> when inheritance general error sql error 144 in aggregate relationship mapping.

Action: Verify the sub-class and the relationship mapping.

RETURN_AND_MAPPING_WITH_INDIRECTION_MISMATCH

Cause: The get method return type for the attribute () is not declared as typebut the mapping is using indirection.

Action: Ensure the get method returns a or change the mapping to not use indirection.

RETURN_AND_MAPPING_WITHOUT_INDIRECTION_ MISMATCH

Cause: The get method return type for the attribute is declared as typebut the mapping is not using indirection.

Action: Ensure the mapping is using indirection or change the return type from

PARAMETER_AND_MAPPING_WITH_INDIRECTION_ MISMATCH

Cause: The set method parameter type for the attribute is not declared as typegeneral error sql error 144, but the mapping is using indirection.

Action: Ensure the set method parameter is declared as a or the mapping is changed to not use indirection.

PARAMETER_AND_MAPPING_WITHOUT_INDIRECTION_ MISMATCH

Cause: The set method parameter type for the attribute is declared as typebut the mapping is not using indirection.

Action: Ensure the mapping is changed to use indirection or the set method parameter is not declared as a .

GET_METHOD_RETURN_TYPE_NOT_VALID

Cause: he get method return type for the attribute should be declared as type Vector (or a type that implements Map or Collection, general error sql error 144, if using Java2).

Action: The get method return type for complete error in hidden module autoexec attribute should be declared as type Vector (or a type that implementsMap or Collection, if using Java2).

SET_METHOD_PARAMETER_TYPE_NOT_VALID

Cause: The set method parameter type for the attribute should be declared as type Vector (or a type that implements Map or Collection, if using Java2).

Action: The set method parameter type for the attribute should be declared as type Vector (or a type that implements Map or Collection, general error sql error 144, if using Java2).

ILLEGAL_TABLE_NAME_IN_MULTIPLE_TABLE_ FOREIGN_KEY

Cause: The table in the multiple table foreign key relationship refers to an unknown table.

Action: Verify the table name.

ATTRIBUTE_AND_MAPPING_WITH_TRANSPARENT_ INDIRECTION_MISMATCH

Cause: The attribute is not declared as a super-type ofbut the mapping is using transparent indirection.

Action: Verify the attribute's type and the mapping setup.

RETURN_AND_MAPPING_WITH_TRANSPARENT_ INDIRECTION_MISMATCH

Cause: The get method return type for the attribute is not declared as a super-type ofbut the mapping is using transparent indirection.

Action: Verify the attribute's type and the mapping setup.

PARAMETER_AND_MAPPING_WITH_TRANSPARENT_ INDIRECTION_MISMATCH

Cause: The set method parameter type for the attribute is not declared as a super-type ofbut the mapping is using transparent indirection.

Action: Verify the attribute's type and the mapping setup.

FIELD_IS_NOT_PRESENT_IN_DATABASE

Cause: Field <fieldname> is not present in the table <tableName> in the database.

Action: Verify the field name for the attribute.

TABLE_IS_NOT_PRESENT_IN_DATABASE

Cause: is not present in the database.

Action: Verify the table name for the descriptor.

MULTIPLE_TABLE_INSERT_ORDER_MISMATCH

Cause: The multiple table insert order Vector specifiedhas more/fewer tables than are specified in the descriptor. All the tables must be included in the insert order Vector.

Action: Verify general error sql error 144 all table names for the descriptor are present and that there are no extras.

INVALID_USE_OF_TRANSPARENT_INDIRECTION

Cause: Transparent Indirection can only general error sql error 144 used with CollectionMappings.

Action: Verify the mapping, general error sql error 144. It must be a collection mapping.

MISSING_INDIRECT_CONTAINER_CONSTRUCTOR

Cause: The indirect container class must implement the constructor.

Action: Implement the constructor for the container.

COULD_NOT_INSTANTIATE_INDIRECT_CONTAINER_CLASS

Cause: The indirect container class could not be instantiated using the constructor.

Action: Validate the constructor for the indirect container class.

INVALID_CONTAINER_POLICY

Cause: This container policy should only be used in JDK containerPolicy. It was instantiated for javaClass.

Action: Validate the container policy being used.

INVALID_CONTAINER_POLICY_WITH_TRANSPARENT_ INDIRECTION

Cause: The container policy is incompatible with transparent indirection.

Action: Change the container policy to be compatible with transparent indirection or do not use transparent indirection.

INVALID_USE_OF_NO_INDIRECTION

Cause: No Indirection should not receive this message.

Action: Change to use no indirection.

INDIRECT_CONTAINER_INSTANTIATION_MISMATCH

Cause: The mapping for the attribute uses transparent indirection and must be initialized to an appropriate container.

Action: Initialize the mapping to an appropriate container.

INVALID_MAPPING_OPERATION

Cause: Invalid mapping operation.

Action: Check the documentation for valid mapping operations.

INVALID_INDIRECTION_POLICY_OPERATION

Cause: Invalid indirection policy operation.

Action: Check the documentation for valid indirection policy operations.

REFERENCE_DESCRIPTOR_IS_NOT_ AGGREGATECOLLECTION

Cause: The reference descriptor for <className> should be set to aggregate collection descriptor.

Action: Set the reference descriptor to an aggregate collection descriptor.

INVALID_INDIRECTION_CONTAINER_CLASS

Cause: Invalid indirection container class.

Action: Verify the container class.

MISSING_FOREIGN_KEY_TRANSLATION

Cause: The mapping does not include a foreign key field linked to the primary key field.

Action: Link the foreign key to the appropriate primary key.

TRUCTURE_NAME_NOT_SET_IN_MAPPING

Cause: The structure name is not set.

Action: Set the structure name appropriately.

NORMAL_DESCRIPTORS_DO_NOT_SUPPORT_ NON_RELATIONAL_EXTENSIONS

Cause: Normal descriptors do not support non-relational extensions.

Action: Contact Technical Support.

PARENT_CLASS_IS_SELF

Cause: The descriptor's parent class has been set to itself.

Action: Contact Technical Support.

PROXY_INDIRECTION_NOT_AVAILABLE

Cause: An attempt to use proxy indirection has been made but JDK is not being used.

Action: Proxy indirection is only supported in JDK

INVALID_ATTRIBUTE_TYPE_FOR_PROXY_INDIRECTION

Cause: The attribute wasn't specified in the list of interfaces given to use Proxy Indirection.

Action: Verify the attribute

INVALID_GET_RETURN_TYPE_FOR _PROXY_INDIRECTION

Cause: The return type for the indirection policy is invalid for the indirection policy.

Action: Verify that the parameter type of the attribute's get method is correct for the indirection policy.

INVALID_SET_PARAMETER_TYPE_FOR_PROXY_ INDIRECTION

Cause: The parameter for the set method is incorrect for the indirection type.

Action: Verify that the parameter type of the attribute's set method is correct for the indirection policy.

INCORRECT_COLLECTION_POLICY

Cause: The container policy is invalid for the collection type.

Action: Check that the container policy is correct for the collection type.

INVALID_AMENDMENT_METHOD

Cause: The amendment method provided is invalid, not public, or cannot be found.

Action: Ensure the amendment method is public, static, returns void and has a single argument: Descriptor.

ERROR_OCCURRED_IN_AMENDMENT_METHOD

Cause: The specified amendment method threw an exception.

Action: Examine the returned exception for further details.

VARIABLE_ONE_TO_ONE_MAPPING_IS_NOT_DEFINED

Cause: There is no mapping for attribute.

Action: Validate the mapping and attribute.

TARGET_INVOCATION_WHILE_CONSTRUCTOR_ INSTANTIATION

Cause: Constructor is missing.

Action: Make the required constructor.

TARGET_INVOCATION_WHILE_CONSTRUCTOR_ INSTANTIATION_OF_FACTORY

Cause: Constructor is missing.

Action: Make the required constructor.

ILLEGAL_ACCESS_WHILE_CONSTRUCTOR_ INSTANTIATION_OF_FACTORY

Cause: Permissions do not permit access to the constructor.

Action: General error sql error 144 the Java security permissions to permit access to the constructor.

INSTANTIATION_WHILE_CONSTRUCTOR_ INSTANTIATION_OF_FACTORY

Cause: An instantiation failed inside the associated constructor.

Action: Determine which objects are being instantiated, and ensure all are being done properly.

NO_SUCH_METHOD_WHILE_CONSTRUCTOR_ INSTANTIATION_OF_FACTORY

Cause: A message send invoked from inside the constructor is invalid because the method does not exist.

Action: Correct the message send ensuring that the message exists.

NULL_POINTER_WHILE_CONSTRUCTOR_ INSTANTIATION_OF_FACTORY

Cause: A message is being sent from inside a constructor to a null object.

Action: Avoid sending a message to an object that is null.

ILLEGAL_ACCESS_WHILE_METHOD_ INSTANTIATION_OF_FACTORY

Cause: A message is being sent to an object from inside a factory instantiation. Java has determined this message to be illegal.

Action: Determine why the message send is illegal, and replace the message with the proper legal one.

TARGET_INVOCATION_WHILE_METHOD_ INSTANTIATION_OF_FACTORY

Cause: Error inside the factory associated with the invocation of a target.

Action: Determine the faulty target, general error sql error 144, and replace with the correct target, or proper message send.

NULL_POINTER_WHILE_METHOD_ INSTANTIATION_OF_FACTORY

Cause: A message is being sent to null inside a factory instantiation.

Action: Avoid sending a message to null.

No such method

Cause: Tokens in the builder generated files are the subsets of all the tokens a Project Reader can understand. Each token has a related public method on TopLink. The exception would mean that the method name is incorrect.

Action: If the project files are not manually edited and corrupted then this is usually an internal exception to TopLink and must be reported to Technical Support. But if the file was manually edited or corrupted then the files must be generated again.

Could not find post load method <methodName> on class <aClass>

Cause: The post load method defined in descriptor properties is not defined on the related domain class.

Action: Must define the method on the specified class.

Cannot write parameter <object> of class <type>

Cause: While creating project class the parameter tokens are read general error sql error 144 the file and are converted to actual types before sending them to the methods. An unknown type will cause this exception.

Action: If the project files are not manually edited and corrupted then this is usually an internal exception to TopLink and must be reported to Technical Support. But if the file was manually edited or corrupted then the files must be generated again.

Could not access method <method>

Cause: Java is throwing an illegal access reflection exception while invoking the method on the object. TopLink only wraps that exception.

Action: Inspect the internal exception and check the Java manuals. If the project files are not manually edited and corrupted then this is usually an internal exception to TopLink and must be reported to Technical Support. But if the file was manually edited or corrupted then the files must be generated again.

Invoking <applyResultMethod> raised exception <exception>

Cause: Java is throwing an invocation reflection exception while invoking the method on the object. TopLink only wraps that exception.

Action: Inspect the internal exception and check the Java manuals. If the project files are not manually edited and corrupted then this is usually an internal exception to TopLink and must be reported to Technical Support. But if the file was manually edited or corrupted then the files must be generated again.

Invalid arguments invoking: <applyResultMethod> with <receiver>

Cause: Java is throwing an invalid argument reflection exception while invoking the method on the object. TopLink only wraps that exception.

Action: Inspect the internal exception and check the Java manuals. If the project files are not manually edited and corrupted then this is usually an internal exception to TopLink and must be reported to Technical Support, general error sql error 144. But if the file was manually edited or corrupted then the files must be generated again.

Could not access <applyResultMethod> with <receiver>

Cause: Java is throwing reflection exception while invoking the method on the object. TopLink only wraps that exception.

Action: Inspect the internal exception and check the Java manuals, general error sql error 144. If the project files are not manually edited and corrupted then this is usually an internal exception to TopLink and must be reported to Technical Support. But if the file was manually edited or corrupted then the files must be generated again.

Parameter mismatch <method>; received <size> parameters

Cause: The number of parameters for the token read from the project or descriptor file do not match the number of parameters a related method can take.

Action: If the project files are not manually edited and corrupted then this is usually an internal exception to TopLink and must be reported to Technical Support. But if the file was manually edited or corrupted then the files must be generated again.

Accessing <methodName> on <className> with <parameters>

Cause: Java is throwing reflection exception while dosfsck read 32 bytes at input/output error the method on the object. TopLink only wraps that exception.

Action: Inspect the internal exception and check the Java manuals. If the project files are not manually edited and corrupted then this is usually an internal exception to TopLink and must be reported to Technical Support. But if the file was manually edited or corrupted then the files must be generated again.

Could not find section definition <section> when building section definitions for <target>

Cause: Invalid section name was found in the project or descriptor file.

Action: If the project files are not manually edited and corrupted then this is usually an internal exception to TopLink and must be reported to Technical Support. But if the file was manually edited or corrupted then the files must be generated again.

Could not convert <object> into an accessible Java class.

Cause: The parameter read from the file cannot be converted to a appropriate type.

Action: If the project files are not manually edited and corrupted then this is usually an internal exception to TopLink and must be reported to Technical Support. But if the file was manually edited or corrupted then the files must be generated again.

File not found

Cause: The project or descriptor file was not found.

Action: Check that the path was given correctly in a project reader and also the path is correct in project file.

Invalid class/method name format.

Cause: No one should actually be using the URL way of reading INI files. This is untested and undocumented feature.

Action: Use other ways of reading files.

Open failed for URL <url>

Cause: Open failed for URL.

Action: General error sql error 144 the internal exception and check the Java manuals.

Could not resolve INIFile location: <sourceString> using search paths <searchPaths>

Cause: The file was not found on the given search paths.

Action: Check your search paths.

Invoking <method> on <receiver>

Cause: Java is throwing reflection exception while invoking the method on the object. TopLink only wraps that exception.

Action: Inspect the internal exception and check the Java manuals. If the project files are not manually edited and corrupted then this is usually an internal exception to TopLink and must be reported to Technical Support, general error sql error 144. But if the file was manually edited or corrupted then the files must be generated again.

Invoking <method> on <receiver>

Cause: Java is throwing reflection exception while invoking the method on the object. TopLink only wraps that exception.

Action: Inspect the internal exception and check the Java manuals. If the project files are not manually edited and corrupted then this is usually an internal exception to TopLink and must be reported to Technical Support. But if the file was manually edited or corrupted then the files must be generated again.

Invalid character value; expecting $* format

Cause: An invalid character format was written to the file.

Action: If the project files are not manually edited and corrupted then this is usually an internal exception to TopLink and must be reported to Technical Support. But if the file was manually edited or corrupted then the files must be generated again.

Unexpected character: {

Cause: Unexpected character { found while reading vector values from the file.

Action: If the project files are not manually edited and corrupted then this is usually an internal exception to TopLink and must be reported to Technical Support, general error sql error 144. But if the file was manually edited or corrupted then the files must be generated again.

Unexpected character: }

Cause: Unexpected character } found while reading vector values from the file.

Action: If the project files are not manually edited and corrupted then this is usually an internal exception to TopLink and must be reported to Technical Support, general error sql error 144. But if the file was manually edited or corrupted then the files must be generated again.

Expecting object, found token <nextToken>

Cause: Unexpected token found while reading from the file.

Action: If the project files are not manually edited and corrupted then this is usually an internal exception to TopLink and must be reported to Technical Support. But if the file was manually edited or corrupted then the files must be generated again.

Unexpected word

Cause: Unexpected token found while reading from the file.

Action: If the project files are not manually edited and corrupted then this is usually an internal exception to TopLink and must be reported to Technical Support. But if the file was manually edited or corrupted then the files must be generated again.

setExistenceChecking <token>; not understood

Cause: Pkg add error checking string general error sql error 144 on the descriptor is not understood.

Action: If the project files are not manually edited and corrupted then this is usually an internal exception to TopLink and must be reported to Technical Support. But if the file was manually edited or corrupted then the files must be generated again.

Class <className> not found

Cause: Java is rjls lkz alfa antiterror reflection exception while invoking the method on the object. TopLink only wraps that exception.

Action: Inspect the internal exception and check the Java manuals. If the project files general error sql error 144 not manually edited and corrupted then this is usually an internal exception to TopLink and must be reported to Technical Support. But if the file was manually edited or corrupted then the files must be generated again.

Not enough INI elements. Found <count>.

Cause: If the line in an INI file is incomplete, i.e., it does not have enough tokens.

Action: If the project files are not manually edited and corrupted then this is usually an internal exception to TopLink and must be reported to Technical Support. But if the file was manually edited or corrupted then the files must be generated again.

Too many INI elements. Found <count>.

Cause: If the line in an INI file has more tokens then needed.

Action: If the project files are not manually edited and corrupted then this is usually an internal exception to TopLink and must be reported to Technical Support. But if the file was manually edited or corrupted then the files must be generated again.

Error writing <writeString>

Cause: Could not write into the file. Perhaps are used and file or directory structure does not exist.

Action: Inspect the internal exception and check the Java manuals. Try using .

Illegal access exception

Cause: Java is throwing reflection exception while invoking the method on the object, general error sql error 144. TopLink only wraps that exception.

Action: Inspect the internal exception and check the Java manuals.

Invocation target exception

Cause: Java is throwing reflection exception while invoking the method on the object. TopLink only wraps that exception.

Action: Inspect the internal exception and check general error sql error 144 Java manuals.

Attempting to instantiate <className> with default constructor.

Cause: Java is throwing reflection exception while instantiating the object. TopLink only wraps that exception.

Action: Inspect the internal exception and check the Java manuals.

Attempting to instantiate <className> with default constructor.

Cause: Java is throwing reflection exception while instantiating the object. TopLink only wraps that exception.

Action: Inspect the internal exception and check the Java manuals.

IO Exception in next token

Cause: Java is throwing reflection, general error sql error 144. TopLink only wraps that exception.

Action: Inspect the internal exception and check the Java manuals.

IOException on close.

Cause: Java is throwing reflection. TopLink only wraps that exception.

Action: Inspect the internal exception and check the Java manuals.

Invalid INI(URL) Method: <method>. Should return a string.

Cause: No one should actually be using the URL way of reading INI files. This is untested and undocumented feature.

Action: Use other ways of reading files.

Could not cast using <castString>.

Cause: An error occurred during an attempt to cast using the

Action: Validate the

A writer or a target file name must be specified

Cause: A writer or a target file name is not specified.

Action: A writer or a target file name must be specified.

IOException on open.

Cause: Java is throwing reflection, general error sql error 144. TopLink only wraps that exception.

Action: Inspect the internal exception and check the Java manuals.

Post Load Method Not Static

Cause: The method specified is not static.

Action: Modify the method to be static.

Project Not Found.

Cause: No projects were found in the specified directory.

Action: Verify the directory.

Multiple Projects With Name.

Cause: More than one project with the same name was found.

Action: Verify the project name.

WAIT_WAS_INTERRUPTED

Cause: In a multi threaded environment one of the waiting thread was interrupted, general error sql error 144.

Action: Usually such exceptions would mean restarting the application but it is totally dependent on the application.

WAIT_FAILURE_SERVER

Cause: Wait failure on ServerSession, general error sql error 144. When the number of non-pooled connections reach the threshold any more requests for such connection results in wait until some one releases the connection resource, general error sql error 144. If this wait was interrupted then an exception is thrown.

Action: Usually such exceptions would mean restarting the application but it is totally dependent on the application.

WAIT_FAILURE_CLIENT

Cause: Wait failure on ClientSession. When the number of pooled connections reach the threshold any more requests for such connection results in wait until some one releases the connection resource. If this wait was interrupted then an exception is thrown.

Action: Usually such exceptions would mean restarting the application but it is totally dependent on the application.

SIGNAL_ATTEMPTED_BEFORE_WAIT

Cause: A signal was attempted before wait on concurrency manager. This normally means that an attempt was made to commit or rollback a transaction before it was started, or to rollback a transaction twice.

Action: Check transactions in the application.

COULD_NOT_BE_CONVERTED

Cause: The object <object> of class <objectClass> could not be converted to <javaClass>. The object cannot be converted to given type.

Action: Check that the object being converted is of right type or not.

INCORRECT_DATE_FORMAT

Cause: The date in <dateString> is in an incorrect format. Expected format is YYYY-MM-DD.

Action: Check the date format.

INCORRECT_TIME_FORMAT

Cause: The time in <timeString> is in an incorrect format. Expected format is HH:MM:SS.

Action: Check the time format.

INCORRECT_TIMESTAMP_FORMAT

Cause: The timestamp <timestampString> is in an incorrect format, general error sql error 144. Expected format is YYYY-MM-DD HH:MM:sprers.euNNN.

Action: Check the timestamp format.

COULD_NOT_CONVERT_TO_BYTE_ARRAY

Cause: The String object must be of even length to be converted to a ByteArray. This object could not be converted to a ByteArray

Action: Check the object being converted.

COULD_NOT_BE_CONVERTED_TO_CLASS

Cause: The object <object> of class <objectClass> could not be converted to <javaClass>. The class <javaClass> is mw3 error during on the CLASSPATH.

Action: Check that the class <javaClass> is on the CLASSPATH.

SQL_EXCEPTION

Cause: An SQL exception was encountered, thrown by the underlying JDBC bridge. TopLink only wraps that exception.

Action: One must inspect the internal exception thrown.

CONFIGURATION_ERROR_CLASS_NOT_FOUND

Cause: The driver class name was not found.

Action: Check the class name given in JDBCLogin.

DATABASE_ACCESSOR_NOT_CONNECTED

Cause: Session is not connected to the database while doing reading or writing on the database.

Action: An application may have to login again because the connection to the database might have been lost.

ERROR_READING_BLOB_DATA

Cause: Error reading blob data from the database. There are two possibilities for this exception, first is that the blob data was not read properly from the result set or the TopLink could not process the blob data usinggeneral error sql error 144.

Action: Check if the underlying driver support blobs properly or not and if it does then report this problem to Technical Support.

OULD_NOT_CONVERT_OBJECT_TYPE

Cause: Could not convert object type on internal error, general error sql error 144. sprers.eu = <type>. The object from the result set cannot be converted to the type returned from the metadata information.

Action: Check if the underlying driver support the conversion type properly or not and if it does then report this problem to Technical Support.

LOGOUT_WHILE_TRANSACTION_IN_PROGRESS

Cause: An attempt has been made to logout while the transaction is still in progress, general error sql error 144. You cannot logout while a transaction is in progress.

Action: Wait until the transaction is over.

SEQUENCE_TABLE_INFORMATION_NOT_COMPLETE

Cause: The sequence information given to TopLink is not sufficiently complete to get the set of sequence numbers from the database. This usually happens on native sequencing on oracle database.

Action: Check the data given specially the sequence name given in TopLink.

ERROR_PREALLOCATING_SEQUENCE_NUMBERS

Cause: Error preallocating sequence numbers on the database; the sequence table information is not complete.

Action: Check if the sequence table was created on the database properly or not.

CANNOT_REGISTER_SYNCHRONIZATIONLISTENER_ FOR_UNITOFWORK

Cause: Cannot register Synchronization Listener: underlying_exception_string. When the TopLink Session is configured with anany unit of work requested by a client must operate within the context of a JTS external global transaction. When a unit of work is created and the external global transaction is not in existence or if the system cannot acquire a reference to it, this error is reported.

Action: Ensure that a JTS transaction is in progress before acquiring the unit of work.

SYNCHRONIZED_UNITOFWORK_DOES_NOT_ SUPPORT_COMMITANDRESUME

Cause: Synchronized does not support the operation. When the TopLink Session is configured with anany unit of work requested by a client must operate within the context of a JTS external global transaction (see Error code: ). The JTS specification does not support the concept of "checkpointing" a transaction, that is, committing the work done and then continuing to work within the same transaction context (JTS does not support nested transactions, either). Thus, if client code invokes on a "synchronized" unit of work, this error will be general error sql error 144 None.

CONFIGURATION_ERROR_NEW_INSTANCE_ INSTANTIATION_EXCEPTION

Cause: Configuration error. Attempting to instantiate Driver: <javaClass>. Could not instantiate driver.

Action: Check the driver.

CONFIGURATION_ERROR_NEW_INSTANCE_ILLEGAL_ ACCESS_EXCEPTION

Cause: A configuration error occurred while attempting to instantiate. Could not instantiate driver.

Action: Check the driver.

TRANSACTION_MANAGER_NOT_SET_FOR_JTS_DRIVER

Cause: The transaction manager has not been set for the .

Action: Set a transaction manager for the .

NO_VERSION_NUMBER_WHEN_DELETING

Cause: An attempt was made to delete the object <object> but it has no version number in the identity map, general error sql error 144. This object either was never read or has already been deleted.

Action: Logging SQL is very helpful in understanding the reason why the exception is thrown. The last delete will show the object we are deleting that throws an exception.

OBJECT_CHANGED_SINCE_LAST_READ_WHEN_DELETING

Cause: The object state has changed in the database. The object <object> cannot be deleted because it has changed or been deleted since it was last read. This usually means that the general error sql error 144 in the table was changed by some other application.

Action: Refreshing an object will refresh the object with the new data from the database.

NO_VERSION_NUMBER_WHEN_UPDATING

Cause: An attempt has been made to update the object <object> but it has no version number in the identity map. It may not have been read before being updated or has been deleted.

Action: Logging SQL is very helpful in understanding the reason why the exception is thrown, general error sql error 144. The last update will show the object we are updating that throws an exception.

OBJECT_CHANGED_SINCE_LAST_READ_WHEN_UPDATING

Cause: The object state has changed in the database. The object <object> cannot be updated because it has changed or been deleted since it was last read. This usually means that the row in the table was changed by some other application.

Action: Refreshing an object will refresh the object with the new data from the database, general error sql error 144.

MUST_HAVE_MAPPING_WHEN_IN_OBJECT

Cause: The object <aClass> must have a non-read-only mapping corresponding to the version lock field. The mapping was not defined for the locking field, general error sql error 144. It is 404 apache errordocument when the lock value is stored in the domain object than in a cache.

Action: Define a mapping for the field.

NEED_TO_MAP_JAVA_SQL_TIMESTAMP

Cause: A write lock value which is stored in a domain object is not an instance of.

Action: Change the value of the attribute to be an instance of .

ADDITIONAL_SIZE_QUERY_NOT_SPECIFIED

Cause: Cursored SQL queries must provide an additional query to retrieve the size of the result set. Custom queries using cursor streams and not specifying the size query will cause this exception. The size query is used to retrieve the size of the number of object read from the database. This is done on JDBC compatible drivers because it provides general error sql error 144 way to extract the size of the result set read. Non custom queries using cursor streams will have default queries generated by TopLink.

Action: slaptest auxpropfunc error invalid parameter supplied Specify a size query.

AGGREGATE_OBJECT_CANNOT_BE_DELETED

Cause: Aggregated objects cannot be written or deleted independent of their owners. There is no identity maintained on such objects.

Action: Application's discretion.

ARGUMENT_SIZE_MISMATCH_IN_QUERY_AND_ QUERY_DEFINITION

Cause: The number of arguments provided to the query for execution does not match the number of arguments provided with the query definition.

Action: Check the query and query execution.

BACKUP_CLONE_IS_ORIGINAL_FROM_PARENT

Cause: The object of class with identity hashcode is not from this unit of work space but from the parent session. The object was never registered in this unit of work but read from the parent session and related to an object registered in the unit of work.

Action: Ensure that you are correctly registering your objects. If you are still having problems, you can use the method to help debug where the error occurred. Please see the general error sql error 144 and FAQ for more information.

BACKUP_CLONE_IS_ORIGINAL_FROM_SELF

Cause: The object clone of class with identity hashcode is the original to a registered new object. The unit of work clones registered new objects, so you must ensure that it is registered before it is reference by another object. If you do not want the new object to be cloned, used the U API.

Action: Ensure that you are correctly registering your objects. If you are still having problems, you can use the method to help debug where the error occurred. Please see time run error 429 manual and FAQ for more information.

BATCH_READING_NOT_SUPPORTED

Cause: This mapping does not support batch reading. The optimization of batching the read of all the target rows is not supported for the mapping.

Action: The problem is a TopLink development problem and user should never encounter this unless the mapping is a new custom mapping. Contact Technical Support.

DESCRIPTOR_IS_MISSING

Cause: Missing descriptor for <reference Class>, general error sql error 144. The descriptor related to the class or the object is not found in the session.

Action: Check if the related descriptor was added to the session or the query is done on the right object or class.

DESCRIPTOR_IS_MISSING_FOR_NAMED_QUERY

Cause: Missing descriptor for <domain Class Name> for query named <queryName>. The descriptor where named query is defined is not added to the session.

Action: Check if the related descriptor was added to the session or the query is done general error sql error 144 the right class.

INCORRECT_SIZE_QUERY_FOR_CURSOR_STREAM

Cause: The size query given on the queries returning cursor streams is not correct. The execution of the size query did not return general error sql error 144 size, general error sql error 144.

Action: If the cursor stream query was custom query than check the size query specified else report this problem to Technical Support.

INVALID_QUERY

Cause: Objects cannot be written in unit of work using modify queries, they must be registered.

Action: Objects are registered in the unit of work and during commit unit of work will do the required changes to the database.

INVALID_QUERY_KEY_IN_EXPRESSION

Cause: The query key <key> does not exist. Usually this happens because of mis-spelled query key.

Action: Check the query key specified in the expression and make sure that a query key was added to the descriptor.

INVALID_QUERY_ON_SERVER_SESSION

Cause: Objects and the database cannot be changed through the server session; all changes must be done through a client session's unit of work. The objects cannot be changed on the server session by modifying queries. Objects are changed in the client sessions acquired from this server session.

Action: Use client session's unit of work to change the object.

NO_CONCRETE_CLASS_INDICATED

Cause: No concrete class indicated for the type in this row. The type indicator read from the database row has no entry in the type indicator hashtable or if class extraction method was used, it did not return any concrete class type. The exception is thrown when sub classes are being read.

Action: Check class extraction method if specified or check the descriptor to see if all the type indicator values were specified or not.

NO_CURSOR_SUPPORT

Cause: No cursor support provided for abstract class multiple table descriptors using expressions.

Action: Consider using custom SQL or multiple queries. <query>

OBJECT_TO_INSERT_IS_EMPTY

Cause: There are no fields to be insert into the table. The fields to insert into the table, <table> is empty. You must define at least one mapping for this table

Action: Must define at least one mapping for this table.

OBJECT_TO_MODIFY_NOT_SPECIFIED

Cause: An object to modify is required for a modify query.

Action: Ensure the query contains an object before executing.

QUERY_NOT_DEFINED

Cause: Query is not defined. When executing query on the session the parameter which takes query is null.

Action: Check if the query is passed properly.

QUERY_SENT_TO_INACTIVE_UNIT_OF_WORK

Cause: The unit of work has been released and is now inactive.

Action: The unit of work, general error sql error 144, once released, cannot be reused unless commitAndResume is called.

READ_BEYOND_QUERY

Cause: An attempt has been made to read from the cursor streams beyond its limits (beyond the end of the stream).

Action: Ensure the general error sql error 144 is being checked for an "end of stream" condition before attempting to retrieve more objects.

REFERENCE_CLASS_MISSING

Cause: The reference class in the query is not specified, general error sql error 144. A reference class must be provided.

Action: Check the query.

REFRESH_NOT_POSSIBLE_WITHOUT_CACHE

Cause: Refresh is not possible if caching is not set. The read queries which skip cache to read objects cannot be used to do refresh the object. Refreshing is not possible without identity.

Action: Check query.

SIZE_ONLY_SUPPORTED_ON_EXPRESSION_QUERIES

Cause: Did not find size query. Size only supported on expression queries, general error sql error 144, unless a size query is given.

Action: Cursor streams on custom query should also define size query.

SQL_STATEMENT_NOT_SET_PROPERLY

Cause: The SQL statement has not been properly set. The user should never encounter this unless queries have been customized.

Action: Contact Technical Support.

INVALID_QUERY_ITEM

Cause: Invalid query item expression.

Action: Validate the Expression being used.

SELECTION_OBJECT_CANNOT_BE_NULL

Cause: The selection object passed to a read object or refresh was null.

Action: Check on the read query.

UNNAMED_QUERY_ON_SESSION_BROKER

Cause: Data read and data modify queries is being executed without the session name. Only object-level queries can be directly executed by the session broker, general error sql error 144, unless the query is named.

Action: Session broker has no idea about such queries about which session to execute the query on. Specify the session name.

REPORT_RESULT_WITHOUT_PKS

Cause: ReportQuery without PKs cannot readObject. The report query result returned is without primary key values. An object from the result can only be created only if primary keys were also read.

Action: Check documentation on on report query.

NULL_PRIMARY_KEY_IN_BUILDING_OBJECT

Cause: The primary key read from the row, <databaseRow> during the execution of the query was detected to be null; primary keys must not contain null.

Action: Check query and also the table on the database.

NO_DESCRIPTOR_FOR_SUBCLASS

Cause: The subclass has no descriptor defined for it.

Action: Check session if the descriptor was added or not or else check class extraction method.

CANNOT_DELETE_READ_ONLY_OBJECT

Cause: Cannot delete an object of read-only class, general error sql error 144. The class <className> is declared read-only in this unit of work. Thrown in unit of work when trying to delete an object that is marked as read only.

Action: Contact Technical Support.

INVALID_OPERATOR

Cause: halt on keyboard error The operator <data> used in the expression is not valid.

Action: Check class to see a list of all of the operators supported.

ILLEGAL_USE_OF_GETFIELD

Cause: Illegal use of <data> in expression. This is a TopLink development exception that users should not encounter.

Action: Report this problem to Technical Support.

ILLEGAL_USE_OF_GETTABLE

Cause: Illegal general error sql error 144 of <data> in expression, general error sql error 144. This is a TopLink development exception that users should not encounter.

Action: Report this problem to Technical Support.

REPORT_QUERY_RESULT_SIZE_MISMATCH

Cause: The number of attributes requested does not match the attributes returned from the database in report query. This usually happens if one gives custom query on the report query.

Action: Check the custom query if it is specified or report this problem to Technical Support.

CANNOT_CACHE_PARTIAL_OBJECT

Cause: Partial Objects are never put in the cache. Partial object queries are not allowed to maintain the cache or be edited. You must set .

Action: Call the method before executing the query.

OUTER_JOIN_ONLY_VALID_FOR_ONE_TO_ONE

Cause: An outer join () is only valid for one to one mappings, and cannot be used for the mapping.

Action: Do not attempt to use for mappings other than one to one.

CANNOT_ADD_TO_CONTAINER

Cause: Cannot add <anObject> to a <containerClass> using <policy>, general error sql error 144. This is TopLink development exception and user should never encounter this problem unless a custom container policy has been written.

Action: Contact Technical Support.

METHOD_INVOCATION_FAILED

Cause: The method invocation of <aMethod> on the object <anObject> threw a Java reflection exception while accessing method.

Action: Check Java documentation on the internal exception.

CANNOT_CREATE_CLONE

Cause: Cannot create a clone of <anObject> using <policy>. This is a TopLink development exception and user should never encounter this problem unless a custom container policy has been written.

Action: Report this problem to Technical Support.

METHOD_NOT_VALID

Cause: The method <methodName> is not valid to call on object <aReceiver>. This is a TopLink development exception and user should never encounter this problem unless a custom container policy has been written.

Action: Contact Technical Support.

METHOD_DOES_NOT_EXIST_IN_CONTAINER_CLASS

Cause: The method named <methodName> was not found in class <aClass>. Thrown when looking for clone method on the container class. The clone is needed to create clones of the container in unit of work.

Action: Define clone method on the container class.

COULD_NOT_INSTANTIATE_CONTAINER_CLASS

Cause: The class <aClass> cannot be used as the container for the results of a query since it cannot be instantiated. Thrown when new interface container policy is being created using Java reflection.

Action: general error sql error 144 Check Java documentation on the internal exception.

MAP_KEY_NOT_COMPARABLE

Cause: Could not use object <anObject> of type <objectClass> as a key into <aContainer> which is of type <containerClass>. Key cannot be compared with the keys currently in the map. Throws Java reflection exception while accessing method.

Action: Check Java documentation on the internal exception.

CANNOT_ACCESS_METHOD_ON_OBJECT

Cause: Cannot reflectively access the method <aMethod> for object: <anObject> of type <anObjectClass>. Throws Java reflection exception while accessing method.

Action: Check Java documentation on the internal exception.

CALLED_METHOD_THREW_EXCEPTION

Cause: The method <aMethod> was called reflectively on object <object> of class <objectClass> and threw an exception. Throws Java reflection exception while accessing method.

Action: Check Java documentation on the internal exception.

INVALID_OPERATION

Cause: Invalid operation <operation> on cursor. The operation is not supported.

Action: Check the class documentation and look for the corresponding method that should be used.

CANNOT_REMOVE_FROM_CONTAINER

Cause: Cannot remove <anObject> of type <anObjectClass> from <aContainerClass> using <policy>. This is TopLink development exception and user should never encounter this problem unless a custom container policy has been written.

Action: Contact Technical Support.

CANNOT_ADD_ELEMENT

Cause: Cannot add element to the collection container policy (cannot add <anObject> of type <anObjectClass> to a <aContainerClass>).

Action: Check Java documentation on the internal exception.

BACKUP_CLONE_DELETED

Cause: Deleted objects cannot have reference after being deleted. The object clone of class <sprers.euss()> with identity hashcode (sprers.eutyHashCode()) <sprers.eutyHashCode(clone)> has been deleted, but still has references.

Action: Ensure general error sql error 144 you are correctly internal error during readsymboltable your objects. If you are still having problems, you can use the method to help debug where the error occurred. Please see the manual and FAQ for more information.

CANNOT_COMPARE_TABLES_IN_EXPRESSION

Cause: Cannot compare table reference to <data> in expression

Action: Check the expression

INVALID_TABLE_FOR_FIELD_IN_EXPRESSION

Cause: Field has invalid table in this context for field <data> in expression.

Action: Check the expression

INVALID_USE_OF_TO_MANY_QUERY_KEY_IN_EXPRESSION

Cause: Invalid use of a query key representing a to-many relationship <data> in expression. Use rather than .

Action: Use the operator instead of .

INVALID_USE_OF_ANY_OF_IN_EXPRESSION

Cause: Invalid use of for a query key not representing a to-many relationship <data> in expression. Use rather than .

Action: Use the operator instead of .

CANNOT_QUERY_ACROSS_VARIABLE_ONE_TO_ ONE_MAPPING

Cause: Querying across a variable one-to-one mapping is not supported.

Action: Change the expression such that the query in not done across a variable one to one mapping.

ILL_FORMED_EXPRESSION

Cause: Ill-formed expression in query, general error sql error 144, attempting to print an object reference into a SQL statement for <queryKey>.

Action: Contact Technical Support.

CANNOT_CONFORM_EXPRESSION

Cause: This expression cannot determine if general error sql error 144 object conforms in mac apache 403 error, you must set the query to check the database.

Action: Change the query such that it does not attempt to conform to the results of the query.

INVALID_OPERATOR_FOR_OBJECT_EXPRESSION

Cause: Object comparisons can only use the or operators, other comparisons must be done through query keys or direct attribute level comparisons.

Action: Ensure the query uses only and if object comparisons are being used.

UNSUPPORTED_MAPPING_FOR_OBJECT_COMPARISON

Cause: Object comparisons can only be used with mappings; other mapping comparisons must be done through query keys or direct attribute level comparisons.

Action: Use a query key instead of attempting to general error sql error 144 objects across the mapping.

OBJECT_COMPARISON_CANNOT_BE_PARAMETERIZED

Cause: Object comparisons cannot be used in parameter queries.

Action: Change the query such that it does not attempt to use object when using parameterized queries.

INCORRECT_CLASS_FOR_OBJECT_COMPARISON

Cause: The class of the argument for the object comparison is incorrect.

Action: Ensure the class for the query is correct.

CANNOT_COMPARE_TARGET_FOREIGN_KEYS_ TO_NULL

Cause: Object comparison cannot be used for target foreign key relationships. Query on the source primary key instead.

Action: Query on source primary key.

INVALID_DATABASE_CALL

Cause: Invalid database call - the call must be an instance of DatabaseCall: <call>.

Action: Ensure the call being used is a DatabaseCall.

INVALID_DATABASE_ACCESSOR

Cause: Invalid database accessor - the accessor must be an instance of DatabaseAccessor: <accessor>.

Action: Ensure the general error sql error 144 being used is a DatabaseAccessor.

METHOD_DOES_NOT_EXIST_ON_EXPRESSION

Cause: Method: <methodName> with argument types: <argTypes> cannot be invoked on Expression.

Action: Ensure the method being used is a supported method.

IN_CANNOT_BE_PARAMETERIZED

Cause: Queries using IN general error sql error 144 be parameterized.

Action: Either disable the query prepare or binding.

REDIRECTION_CLASS_OR_METHOD_NOT_SET

Cause: The redirection query was not configured properly, the class or method name was not set.

Action: Check the configuration for the redirection class.

REDIRECTION_METHOD_NOT_DEFINED_CORRECTLY

Cause: The redirection query's method is not defined or define with the wrong arguments. It must be public static and have arguments DatabaseQuery, DatabaseRow, Session (the interface).

Action: Check the redirection query's method as above.

REDIRECTION_METHOD_ERROR

Cause: The redirection query's method invocation threw an exception.

Action: Check the redirection method for problems.

EXAMPLE_AND_REFERENCE_OBJECT_CLASS_MISMATCH

Cause: There is a class mismatch between the example object and the reference class specified for this query.

Action:

Chapter 2 Server Error Message Reference

  • Error number: ; Symbol: ; SQLSTATE:

    Message: NO

    Used in the construction of other messages.

  • Error number: ; Symbol: ; SQLSTATE:

    Message: YES

    Used in the construction of other messages.

    Extended format generates Note messages. is used in the column for these messages in subsequent output.

  • Error number: ; Symbol: ; SQLSTATE:

    Message: Can't create file '%s' (errno: %d - %s)

    Occurs for failure to create or copy a file needed for some operation, general error sql error 144.

    Possible causes: Permissions problem for source file; destination file already exists but is not writeable. general error sql error 144 Error number: ; Symbol: ; SQLSTATE:

    Message: Can't create table '%s' (errno: %d - %s)

    reports this error when a table cannot be created. If the error message refers to errortable creation failed because a foreign key constraint was not correctly formed. If the error message refers to error samsung lsu hsync error cycle power, table creation probably failed because the table includes a column name that matched the name of an internal table, general error sql error 144.

  • Error number: ; Symbol: ; SQLSTATE:

    Message: Can't create database '%s' (errno: %d - %s)

  • Error number: ; Symbol: ; SQLSTATE:

    Message: Can't create database '%s'; database exists

    An attempt to create a database failed because the database already exists, general error sql error 144.

    Drop the general error sql error 144 first if you really want to replace an existing database, or add an clause to the statement if to retain an existing database without having the statement produce an error.

  • Error number: ; Symbol: ; SQLSTATE:

    Message: Can't drop database '%s'; database doesn't exist

  • Error number: ; Symbol: ; SQLSTATE:

    Message: Error dropping database (can't rmdir '%s', general error sql error 144, errno: %d - %s)

  • Error number: ; Symbol: ; SQLSTATE:

    Message: Can't read record in system table

    Returned by for attempts to access tables when is unavailable.

  • Error number: ; Symbol: ; SQLSTATE:

    Message: Can't get status of '%s' (errno: %d - %s)

  • Error number: ; Symbol: ; SQLSTATE:

    Message: Can't lock file (errno: %d - %s)

  • Error number: ; Symbol: ; SQLSTATE:

    Message: Can't open file: '%s' (errno: %d - %s)

    reports this error when the table from the data files cannot be found.

  • Error number: ; Symbol: ; SQLSTATE:

    Message: Can't find file: '%s' (errno: %d - %s)

  • Error number: ; Symbol: ; SQLSTATE:

    Message: Can't read dir of '%s' (errno: %d - %s)

  • Error number: ; Symbol: ; SQLSTATE:

    Message: Record has changed since last read in table '%s'

  • Error number: ; Symbol: ; SQLSTATE:

    Message: Can't write; duplicate key in table '%s'

  • Error number: ; Symbol: ; SQLSTATE:

    Message: Error reading file '%s' (errno: %d - %s)

  • Error number: ; Symbol: ; General error sql error 144

    Message: Error on rename of '%s' to '%s' (errno: general error sql error 144 - %s)

  • Error number: ; Symbol: ; SQLSTATE:

    Message: Error writing file '%s' (errno: %d - %s)

  • Error number: ; Symbol: ; SQLSTATE:

    Message: '%s' is locked against change

  • Error number: ; Symbol: ; SQLSTATE:

    Message: Sort aborted

    was removed after

  • Error number: ; Symbol: ; SQLSTATE:

    Message: Got error %d - '%s' from storage engine

    Check the value to see what the OS error means. For example, 28 indicates that you have run out of disk space.

  • Error number: ; Symbol: ; SQLSTATE:

    Message: Table storage engine for '%s' doesn't have this option

  • Error number: ; Symbol: ; SQLSTATE:

    Message: Can't find record in '%s'

  • Error number: ; Symbol: ; SQLSTATE:

    Message: Incorrect information in file: '%s'

  • Error number: ; Symbol: ; SQLSTATE:

    Message: Incorrect key file for table '%s'; try to repair it

  • Error number: ; Symbol: ; SQLSTATE:

    Message: Old key file for table '%s'; repair it!

  • Error number: ; Symbol: ; SQLSTATE:

    Message: Table '%s' is general error sql error 144 only

  • Error number: ; Symbol: ; SQLSTATE:

    Message: Out of memory; restart server and try again (needed %d bytes)

  • Error number: ; Symbol: ; SQLSTATE:

    Message: Out of sort memory, consider increasing server sort buffer size

  • Error number: ; Symbol: ; SQLSTATE:

    Message: Too many connections

  • Error number: ; Symbol: ; SQLSTATE:

    Message: Out of memory; check if mysqld or some other process uses all available memory; if not, you may have to use 'ulimit' to allow mysqld to use more memory or you can add more swap space

  • Error number: ; Symbol: ; SQLSTATE:

    Message: Can't get hostname for your address

  • Error number: ; Symbol: ; SQLSTATE:

    Message: Ati3duag.dll error blue screen handshake

  • Error number: ; Symbol: ; SQLSTATE:

    Message: Access denied for user '%s'@'%s' to database '%s'

  • Error number: ; Symbol: ; SQLSTATE:

    Message: Access denied for user '%s'@'%s' (using password: %s)

  • Error number: ; Symbol: ; SQLSTATE:

    Message: No database selected

  • Error number: ; Symbol: ; SQLSTATE:

    Message: Unknown command

  • Error number: ; Symbol: ; SQLSTATE:

    Message: Column '%s' cannot be null

  • Error number: ; Symbol: ; SQLSTATE:

    Message: Unknown database '%s'

  • Error number: ; Symbol: ; SQLSTATE:

    Message: Table '%s' already exists

  • Error number: ; Symbol: ; SQLSTATE:

    Message: Unknown table '%s'

  • Error number: ; Symbol: ; SQLSTATE:

    Message: Column '%s' in %s is ambiguous

    Likely cause: A column appears in a query without appropriate qualification, such as in a select list or ON clause.

    Examples:

    Resolution:

    • Qualify the column with the appropriate table name:

    • Modify the query to avoid the need for qualification:

  • Error number: ; Symbol: ; SQLSTATE:

    Message: Server shutdown in progress

  • Error number: ; Symbol: ; SQLSTATE:

    Message: Unknown column '%s' in '%s'

  • Error number: ; Symbol: ; SQLSTATE:

    Message: '%s' isn't in GROUP BY

  • Error number: ; Symbol: ; SQLSTATE:

    Message: Can't group on '%s'

  • Error number: ; Symbol: ; SQLSTATE:

    Message: Statement has sum functions and columns in same statement

  • Error number: ; Symbol: ; SQLSTATE:

    Message: Column count doesn't match value count

  • Error number: ; Symbol: ; SQLSTATE:

    Message: Identifier name '%s' is too long

  • Error number: ; Symbol: ; SQLSTATE:

    Message: Duplicate column name '%s'

  • Error number: ; Symbol: ; SQLSTATE:

    Message: Duplicate key name '%s'

  • Error number: ; Symbol: ; SQLSTATE:

    Message: Duplicate entry '%s' for key %d

    The message returned with this error uses the format string for.

  • Error number: ; Symbol: ; SQLSTATE:

    Message: Incorrect column specifier for column '%s'

  • Error number: ; Symbol: ; SQLSTATE:

    Message: %s near '%s' at line %d

  • Error number: ; Symbol: ; SQLSTATE:

    Message: Query was empty

  • Error number: ; Symbol: ; SQLSTATE:

    Message: Not unique table/alias: '%s'

  • Error number: ; Symbol: ; SQLSTATE:

    Message: Invalid default value for '%s'

  • Error number: ; Symbol: ; SQLSTATE:

    Message: Multiple primary key defined

  • Error number: ; Symbol: ; SQLSTATE:

    Message: Too many keys specified; max %d keys allowed

  • Error number: ; Symbol: ; SQLSTATE:

    Message: Too many key parts specified; max %d parts allowed

  • Error number: ; Symbol: ; SQLSTATE:

    Message: Specified key was too long; max key length is %d bytes

  • Error number: ; Symbol: ; SQLSTATE:

    Message: Key column '%s' doesn't exist in table

  • Error number: ; Symbol: ; SQLSTATE:

    Message: BLOB column '%s' can't be used in key specification with the used table type

  • Error number: ; Symbol: ; SQLSTATE:

    Message: Column length too big for column '%s' (max = %lu); use BLOB or TEXT instead

  • Error number: ; Symbol: ; SQLSTATE:

    Message: Incorrect table definition; there can be only one auto column and it must be defined as a key

  • Error number: ; Symbol: ; SQLSTATE:

    Message: %s: ready for connections. Version: '%s' socket: '%s' port: %d

  • Error number: ; Symbol: ; SQLSTATE:

    Message: %s: Normal shutdown

    was removed after

  • Error number: ; Symbol: ; SQLSTATE:

    Message: %s: Shutdown complete

  • Error number: ; Symbol: ; SQLSTATE:

    Message: %s: Forcing close of thread %ld user: '%s'

  • Error number: ; Symbol: ; SQLSTATE:

    Message: Can't create IP socket

  • Error number: ; Symbol: ; SQLSTATE:

    Message: Table '%s' has no general error sql error 144 like the one used in CREATE INDEX; recreate the table

  • Error number: ; Symbol: ; SQLSTATE:

    Message: Field separator argument is not what is expected; check the manual

  • Error number: ; Symbol: ; SQLSTATE:

    Message: You can't use fixed rowlength with BLOBs; please use 'fields terminated by'

  • Error number: ; Symbol: ; SQLSTATE:

    Message: The file '%s' must be in the database directory or be readable by all

  • Error number: ; Symbol: ; SQLSTATE:

    Message: File '%s' already exists

  • Error number: ; Symbol: ; SQLSTATE:

    Message: Records: %ld Deleted: %ld Skipped: %ld Warnings: %ld

  • Error number: ; Symbol: ; SQLSTATE:

    Message: Records: %ld Duplicates: %ld

  • Error number: ; Symbol: ; SQLSTATE:

    Message: Incorrect prefix key; the used key part isn't a string, the used length is longer than the key part, or the storage engine doesn't support unique prefix keys

  • Error number: ; Symbol: ; SQLSTATE:

    Message: You can't delete all columns with ALTER TABLE; use DROP TABLE instead

  • Error number: ; Symbol: ; SQLSTATE:

    Message: Can't DROP '%s'; check that column/key exists

  • Error number: ; Symbol: ; SQLSTATE:

    Message: Records: %ld Duplicates: %ld Warnings: %ld

  • Error number: ; Symbol: ; SQLSTATE:

    Message: You can't specify target table '%s' for update in Error 1064 42000 clause

    This error occurs for attempts to select from and modify the same table within a single statement, general error sql error 144. If the select attempt occurs within a derived table, you can avoid this error by setting the flag of the system variable to force the subquery to be materialized into a temporary table, which effectively causes it to be a different table general error sql error 144 the one modified. See Optimizing Derived Tables, View References, and Common Table Expressions with Merging or Materialization, general error sql error 144.

  • Error number: ; Symbol: ; SQLSTATE:

    Message: Unknown thread id: %lu

  • Error number: ; Symbol: ; SQLSTATE:

    Message: You are not owner of thread %lu

  • Error number: ; Symbol: ; SQLSTATE:

    Message: No tables used

  • Error number: ; Symbol: ; SQLSTATE:

    Message: Too many strings for column %s and SET

  • Error number: ; Symbol: ; SQLSTATE:

    Message: Can't generate a unique log-filename %s.()

  • Error number: ; Symbol: ; SQLSTATE:

    Message: Table '%s' was locked with a READ lock and can't be updated

  • Error number: ; Symbol: ; SQLSTATE:

    Message: Table '%s' was not locked with LOCK TABLES

  • Error number: ; Symbol: ; SQLSTATE:

    Message: BLOB, TEXT, GEOMETRY or JSON column '%s' can't have a default value

  • Error number: ; Symbol: ; SQLSTATE:

    Message: Incorrect database name '%s'

  • Error number: ; Symbol: ; SQLSTATE:

    Message: Incorrect table name '%s'

  • Error number: ; Symbol: ; SQLSTATE:

    Message: The SELECT would examine more than MAX_JOIN_SIZE rows; check your WHERE and use SET SQL_BIG_SELECTS=1 or SET MAX_JOIN_SIZE=# if the SELECT is okay

  • Error number: ; Symbol: ; SQLSTATE:

    Message: Unknown general error sql error 144

  • Error number: ; Symbol: ; SQLSTATE:

    Message: Unknown procedure '%s'

  • Error number: ; Symbol: ; SQLSTATE:

    Message: Incorrect parameter count sql server error 1706 procedure '%s'

  • Error number: ; Symbol: ; SQLSTATE:

    Message: Incorrect parameters to procedure '%s'

  • Error number: ; Symbol: ; SQLSTATE:

    Message: Unknown table '%s' in %s

  • Error number: ; Symbol: ; SQLSTATE:

    Message: Column '%s' specified twice

  • Error number: ; Symbol: ; SQLSTATE:

    Message: Invalid use of group function

  • Error number: ; Symbol: ; SQLSTATE:

    Message: Table '%s' uses an extension that doesn't exist in this MySQL version

  • Error number: ; Symbol: ; SQLSTATE:

    Message: A table must have at least 1 column

  • Error number: ; Symbol: ; SQLSTATE:

    Message: The table '%s' is full

    reports this error when the system tablespace runs out of free space. Reconfigure the system tablespace to add a new data file.

  • Error number: ; Symbol: ; SQLSTATE:

    Message: Unknown character set: '%s'

  • Error number: ; Symbol: ; SQLSTATE:

    Message: Too many tables; MySQL can only use %d tables in a join

  • Error number: ; Symbol: ; SQLSTATE:

    Message: Too many columns

  • Error number: ; Symbol: ; SQLSTATE:

    Message: Row size too large. The maximum row size for the used table type, not counting BLOBs, is %ld, general error sql error 144. This includes storage overhead, general error sql error 144, check the manual. You have to change some columns to TEXT or BLOBs

  • Error number: ; Symbol: ; SQLSTATE:

    Message: Thread stack overrun: Used: %ld of a %ld stack. Use 'mysqld --thread_stack=#' to specify a bigger stack if needed

  • Error number: ; Symbol: ; SQLSTATE:

    Message: Cross dependency found in OUTER JOIN; examine your ON conditions

    was removed after

  • Error number: ; Symbol: ; SQLSTATE:

    Message: Cross dependency found in OUTER JOIN; examine your ON conditions

    was added in

  • Error number: ; Symbol: ; SQLSTATE:

    Message: Table handler doesn't support NULL in given index. Please change column '%s' to be NOT NULL or use another handler

  • Error number: ; Symbol: ; SQLSTATE:

    Message: Can't load function '%s'

  • Error number: ; Symbol: ; SQLSTATE:

    Message: Can't initialize function '%s'; %s

  • Error number: ; Symbol: ; SQLSTATE:

    Message: No paths allowed for shared library

  • Error number: ; Symbol: ; SQLSTATE:

    Message: Function '%s' already exists

  • Error number: ; Symbol: ; SQLSTATE:

    Message: Can't open shared library '%s' (errno: %d %s)

  • Error number: ; Symbol: ; SQLSTATE:

    Message: Can't find symbol '%s' in library

  • Error number: ; Symbol: ; SQLSTATE:

    Message: Function '%s' is not defined

  • Error number: ; Symbol: ; SQLSTATE:

    Message: Host '%s' is blocked because of many connection errors; unblock with 'mysqladmin flush-hosts'

  • Error number: ; Symbol: ; SQLSTATE:

    Message: Host '%s' is not allowed to connect to this MySQL server

  • Error number: ; Symbol: ; SQLSTATE:

    Message: You are using MySQL as an anonymous user and anonymous users are not allowed to change passwords

  • Error number: ; Symbol: ; SQLSTATE:

    Message: You must have privileges to update tables in the mysql database to be able to change passwords for others

  • Error number: ; Symbol: ; SQLSTATE:

    Message: Can't find any matching row in the user table

  • Error number: ; Symbol: ; SQLSTATE:

    Message: Rows matched: %ld Changed: %ld Warnings: %ld

  • Error number: ; Symbol: ; SQLSTATE:

    Message: Can't create a new thread (errno %d); if you are not out of available memory, general error sql error 144, you can consult the manual for a possible OS-dependent bug

  • Error number: ; Symbol: ; SQLSTATE:

    Message: Column count doesn't match value count at row %ld

  • Error number: ; Symbol: ; SQLSTATE:

    Message: Can't reopen table: '%s'

  • Error number: ; Symbol: ; SQLSTATE:

    Message: Invalid use of NULL value

  • Error number: ; Symbol: ; SQLSTATE:

    Message: Got error '%s' from regexp

  • Error number: ; Symbol: ; SQLSTATE:

    Message: Mixing of GROUP columns (MIN(),MAX(),COUNT(),) with no GROUP columns is illegal if there is no GROUP BY clause

  • Error number: ; Symbol: ; SQLSTATE:

    Message: There is no such grant defined for user '%s' on host '%s'

  • Error number: ; Symbol: ; SQLSTATE:

    Message: %s command denied to user '%s'@'%s' for table '%s'

  • Error number: ; Symbol: ; SQLSTATE:

    Message: %s command denied to user '%s'@'%s' for column '%s' in table '%s'

  • Error number: ; Symbol: ; SQLSTATE:

    Message: Illegal GRANT/REVOKE command; please consult the manual to see which privileges can be error c 2024 vs 2005

  • Error number: ; Symbol: ; SQLSTATE:

    Message: The host or user argument to GRANT is too long

  • Error number: ; Symbol: ; SQLSTATE:

    Message: Table '%s.%s' doesn't exist

  • Error number: ; Symbol: ; SQLSTATE:

    Message: There is no such grant defined for user '%s' on host '%s' on table '%s'

  • Error number: ; Symbol: ; SQLSTATE:

    Message: The used command is not allowed with this MySQL version

  • Error number: ; Symbol: ; SQLSTATE:

    Message: You have an error in your SQL syntax; check the manual that corresponds to your MySQL server version for the right syntax to use

  • Error number: ; Symbol: ; SQLSTATE:

    Message: Aborted connection %ld to db: '%s' user: '%s' (%s)

  • Error number: ; Symbol: ; SQLSTATE:

    Message: Got a packet bigger than 'max_allowed_packet' bytes

  • Error number: ; Symbol: ; SQLSTATE:

    Message: Got a read error from the connection pipe

  • Error number: ; Symbol: ; SQLSTATE:

    Message: Got an error from fcntl()

  • Error number: ; Symbol: ; SQLSTATE:

    Message: Got packets out of order

  • Error number: ; Symbol: ; SQLSTATE:

    Message: Couldn't uncompress communication packet

  • Error number: ; Symbol: ; SQLSTATE:

    Message: Got an error reading communication packets

  • Error number: ; Symbol: ; SQLSTATE:

    Message: Got timeout reading communication packets

  • Error number: ; Symbol: ; SQLSTATE:

    Message: Got an error writing communication packets

  • Error number: ; Symbol: ; SQLSTATE:

    Message: Got timeout writing communication packets

  • Error number: ; Symbol: ; SQLSTATE:

    Message: Result string is longer than 'max_allowed_packet' bytes

  • Error number: ; Symbol: ; SQLSTATE:

    Message: The used table type doesn't support BLOB/TEXT columns

  • Error number: ; Symbol: ; SQLSTATE:

    Message: The used table type doesn't support AUTO_INCREMENT columns

  • Error number: ; Symbol: ; SQLSTATE:

    Message: Incorrect column name '%s'

  • Error number: ; Symbol: ; SQLSTATE:

    Message: The used storage engine can't index column '%s'

  • Error number: ; Symbol: ; SQLSTATE:

    Message: Unable to open underlying table which is differently defined or of non-MyISAM type or doesn't exist

  • Error number: ; Symbol: ; SQLSTATE:

    Message: Can't write, because of unique constraint, to table '%s'

  • Error number: ; Symbol: ; SQLSTATE:

    Message: BLOB/TEXT column '%s' used in key specification without a key length

  • Error number: ; Symbol: ; SQLSTATE:

    Message: All parts of a PRIMARY KEY must be NOT NULL; if you need NULL in a key, use UNIQUE instead

  • Error number: ; Symbol: ; SQLSTATE:

    Message: Result consisted of more than one row

  • Error number: ; Symbol: ; SQLSTATE:

    Message: This table type requires a primary key

  • Error number: ; Symbol: ; SQLSTATE:

    Message: You are using safe update mode and you tried to update a table without a WHERE that uses a KEY column. %s

  • Error number: ; Symbol: ; SQLSTATE:

    Message: Key '%s' doesn't exist in table '%s'

  • Error number: ; Symbol: general error sql error 144 SQLSTATE:

    Message: Can't open table

  • Error number: ; Symbol: ; SQLSTATE:

    Message: The storage engine for the table doesn't support %s

  • Error number: ; Symbol: ; SQLSTATE:

    Message: You are not allowed to execute this command in a transaction

  • Error number: ; Symbol: ; SQLSTATE:

    Message: Got error %d - '%s' during COMMIT

  • Error number: ; Symbol: ; SQLSTATE:

    Message: Got error %d - '%s' during ROLLBACK

  • Error number: ; Symbol: ; SQLSTATE:

    Message: Got error %d during FLUSH_LOGS

  • Error number: ; Symbol: ; SQLSTATE:

    Message: Aborted connection %u to db: '%s' user: '%s' host: '%s' (%s)

  • Error number: ; Symbol: ; SQLSTATE:

    Message: Error from master: '%s'

  • Error number: ; Symbol: ; SQLSTATE:

    Message: Net error reading from master

  • Error number: ; Symbol: ; SQLSTATE:

    Message: Net error writing to master

  • Error number: ; Symbol: ; SQLSTATE:

    Message: Can't find FULLTEXT index matching the column list

  • Error number: ; Symbol: ; SQLSTATE:

    Message: Can't execute the given command because you have active locked tables or an active transaction

  • Error number: ; Symbol: ; SQLSTATE:

    Message: Unknown system variable '%s'

  • Error number: ; Symbol: ; SQLSTATE:

    Message: Table '%s' is marked as crashed and should be repaired

  • Error number: ; Symbol: ; SQLSTATE:

    Message: Table '%s' is marked as crashed and last (automatic?) repair failed

  • Error number: ; Symbol: ; SQLSTATE:

    Message: Some non-transactional changed tables couldn't be rolled back

  • Error number: ; Symbol: ; SQLSTATE:

    Message: Multi-statement transaction required more than 'max_binlog_cache_size' bytes of storage; increase this mysqld variable and try again

  • Error number: ; Symbol: ; SQLSTATE:

    Message: This operation requires a running slave; configure slave and do START SLAVE

  • Error number: ; Symbol: ; SQLSTATE:

    Message: The server is not configured as slave; fix in config file or with CHANGE MASTER TO

  • Error number: ; Symbol: ; SQLSTATE:

    Message: Could not initialize master info structure; more error messages can be found in the MySQL error log

  • Error number: ; Symbol: ; SQLSTATE:

    Message: Could not create slave thread; check system resources

  • Error number: ; Symbol: ; SQLSTATE:

    Message: User %s already has more than 'max_user_connections' active connections

  • Error number: ; Symbol: ; SQLSTATE:

    Message: You may only use constant expressions with SET

  • Error number: ; Symbol: ; SQLSTATE:

    Message: Lock wait timeout exceeded; try restarting transaction

    reports this error when lock wait timeout expires. The statement that waited too long was rolled back (not the entire transaction). You can increase the value of the configuration option if SQL statements should wait longer for other transactions to complete, or decrease it if too many long-running transactions are causing locking problems and reducing concurrency on a busy system.

  • Error number: ; Symbol: ; SQLSTATE:

    Message: The total number of locks exceeds the lock table size

    reports this error when the total number of locks exceeds the amount of memory devoted to managing locks. To avoid this error, general error sql error 144, increase the value of. Within an individual application, a workaround may be to break a large operation into smaller pieces. For example, if the error occurs for a largeperform several smaller operations.

  • Error number: ; Symbol: ; SQLSTATE:

    Message: Update locks cannot be acquired during a READ UNCOMMITTED transaction

  • Error number: ; Symbol: ; SQLSTATE:

    Message: Incorrect arguments to %s

  • Error number: ; Symbol: ; SQLSTATE:

    Message: '%s'@'%s' is not allowed to create new users

  • Error number: ; Symbol: ; SQLSTATE:

    Message: Deadlock found when trying to get lock; try restarting transaction

    reports this error when a transaction encounters a deadlock and is automatically rolled back so that your application can take corrective action. To recover from this error, run all the operations in this transaction again. A deadlock occurs when requests for locks arrive in inconsistent order between transactions. The transaction that was rolled back released all its locks, general error sql error 144, and the other transaction can now get all the locks it requested, general error sql error 144. Thus, when you re-run the transaction that was rolled back, it might have to wait for other transactions to complete, but typically the deadlock does not recur. If you encounter frequent deadlocks, make the sequence of locking operations (,and so on) consistent between the different transactions or applications that experience the issue. See Deadlocks in InnoDB for details.

  • Error number: ; Symbol: ; SQLSTATE:

    Message: The used table type doesn't support FULLTEXT indexes

  • Error number: ; Symbol: ; SQLSTATE:

    Message: Cannot add foreign key constraint

  • Error number: ; Symbol: ; SQLSTATE:

    Message: Cannot add or update a child row: a foreign key constraint fails

    reports this error when you try to add a row but there is no parent row, and a foreign key constraint fails. Add the parent row first.

  • Error number: ; Symbol: ; SQLSTATE:

    Message: Cannot delete or update a parent row: a foreign key constraint fails

    reports this error when you try to delete a parent row that has children, general error sql error 144, and a foreign key constraint fails. Delete the children first.

  • Error number: ; Symbol: ; SQLSTATE:

    Message: Error connecting to master: %s

  • Error number: ; Symbol: ; SQLSTATE:

    Message: Error when executing command %s: %s

  • Error number: ; Symbol: ; SQLSTATE:

    Message: Incorrect usage of %s and %s

  • Error number: ; Symbol: ; SQLSTATE:

    Message: The used SELECT statements have a different number of swiftnet link error codes

  • Error number: ; Symbol: ; SQLSTATE:

    Message: Can't execute the query because you have a conflicting read lock

  • Error number: ; Symbol: ; SQLSTATE:

    Message: Mixing of transactional and non-transactional tables is disabled

  • Error number: ; Symbol: ; SQLSTATE:

    Message: Option '%s' used twice in statement

  • Error number: ; Symbol: ; SQLSTATE:

    Message: User '%s' has exceeded the '%s' resource (current value: %ld)

  • Error number: ; General error sql error 144 ; SQLSTATE:

    Message: Access denied; you need (at least one of) the %s privilege(s) for this operation

  • Error number: ; Symbol: ; SQLSTATE:

    Message: Variable '%s' is a SESSION variable and can't be used with SET GLOBAL

  • Error number: ; Symbol: ; SQLSTATE:

    Message: Variable '%s' is a GLOBAL variable and should be set with SET GLOBAL

  • Error number: ; Symbol: ; SQLSTATE:

    Message: Variable '%s' doesn't have a default value

  • Error number: ; Symbol: ; SQLSTATE:

    Message: Variable '%s' can't be set to the value of '%s'

  • Error number: ; Symbol: ; SQLSTATE:

    Message: Incorrect argument type to variable '%s'

  • Error number: ; Symbol: ; SQLSTATE:

    Message: Variable '%s' can only be set, not read

  • Error number: ; Symbol: ; SQLSTATE:

    Message: Incorrect usage/placement of '%s'

  • Error number: ; Symbol: ; SQLSTATE:

    Message: This version of MySQL doesn't yet support '%s'

  • Error number: ; Symbol: ; SQLSTATE:

    Message: Got fatal error %d from master when reading data from binary log: '%s'

  • Error number: ; Symbol: ; SQLSTATE:

    Message: Slave SQL thread ignored the query because of replicate-*-table rules

  • Error number: ; Symbol: ; SQLSTATE:

    Message: Variable '%s' is a %s variable

  • Error number: ; Symbol: ; SQLSTATE:

    Message: Incorrect foreign key definition for '%s': %s

  • Error number: ; Symbol: ; SQLSTATE:

    Message: Key reference and table reference don't match

  • Error number: ; Symbol: ; SQLSTATE:

    Message: Operand should contain %d column(s)

  • Error number: ; Symbol: ; SQLSTATE:

    Message: Subquery returns more than 1 row

  • Error number: ; Symbol: ; SQLSTATE:

    Message: Unknown prepared statement handler (%.*s) given to %s

  • Error number: ; Symbol: ; SQLSTATE:

    Message: Help database is corrupt or does not exist

  • Error number: ; Symbol: ; SQLSTATE:

    Message: Converting column '%s' from %s to %s

  • Error number: ; Symbol: ; SQLSTATE:

    Message: Reference '%s' not supported (%s)

  • Error number: ; Symbol: ; SQLSTATE:

    Message: Every derived table must have its own alias

  • Error number: ; Symbol: ; SQLSTATE:

    Message: Select %u was reduced during optimization

  • Error number: ; Symbol: ; SQLSTATE:

    Message: Table '%s' from one of the SELECTs cannot be used in %s

  • Error number: ; Symbol: ; SQLSTATE:

    Message: Client does not support authentication protocol requested by server; consider upgrading MySQL client

  • Error number: ; Symbol: ; SQLSTATE:

    Message: All parts of general error sql error 144 SPATIAL index must be NOT NULL

  • Error number: ; Symbol: ; SQLSTATE:

    Message: COLLATION '%s' is not valid for CHARACTER SET '%s'

  • Error number: ; Symbol: ; SQLSTATE:

    Message: Uncompressed data size too large; the maximum size is %d (probably, length of uncompressed data was corrupted)

  • Error number: ; Symbol: ; SQLSTATE:

    Message: ZLIB: Not enough memory

  • Error number: ; Symbol: ; SQLSTATE:

    Message: ZLIB: Not enough room in the output buffer (probably, length of uncompressed data was corrupted)

  • Error number: ; Symbol: ; SQLSTATE:

    Message: ZLIB: General error sql error 144 data corrupted

  • Error number: ; Symbol: ; SQLSTATE:

    Message: Row %u was cut by GROUP_CONCAT()

  • Error number: ; Symbol: ; SQLSTATE:

    Message: Row %ld doesn't contain data for all columns

  • Error number: ; Symbol: ; SQLSTATE:

    Message: Row %ld was truncated; it contained more data than there were input columns

  • Error number: ; Symbol: ; SQLSTATE:

    Message: Column set to default value; NULL supplied to NOT NULL column '%s' at row %ld

  • Error number: ; Symbol: ; SQLSTATE:

    Message: Out of range value for column '%s' at row %ld

  • Error number: ; Symbol: ; SQLSTATE:

    Message: Data truncated for column '%s' at row %ld

  • Error number: ; Symbol: ; SQLSTATE:

    Message: Using storage engine %s for table '%s'

  • Error number: ; Symbol: ; SQLSTATE:

    Message: Illegal mix of collations (%s,%s) gigabyte p35-ds3 checksum error (%s,%s) for operation '%s'

  • Error number: ; Symbol: ; SQLSTATE:

    Message: Can't revoke all privileges for one or more of the requested users

  • Error number: ; Symbol: ; SQLSTATE:

    Message: Illegal mix of collations (%s,%s), (%s,%s), (%s,%s) for operation '%s'

  • Error number: ; Symbol: ; SQLSTATE:

    Message: Illegal mix of collations for operation '%s'

  • Error number: ; Symbol: ; SQLSTATE:

    Message: Variable '%s' is not a variable component (can't be used as sprers.eule_name)

  • Error number: ; Symbol: ; SQLSTATE:

    Message: Unknown collation: '%s'

  • Error number: ; Symbol: ; SQLSTATE:

    Message: SSL parameters in CHANGE MASTER are ignored because this MySQL slave was compiled without SSL support; they can be used later if MySQL slave with SSL is started

  • Error number: general error sql error 144 Symbol: ; SQLSTATE:

    Message: Server is running in --secure-auth mode, general error sql error 144, but '%s'@'%s' has a password in the old format; please change the password to the new format

    was removed after

  • Error number: ; Symbol: ; SQLSTATE:

    Message: Field or reference '%s%s%s%s%s' of SELECT #%d was resolved in SELECT #%d

  • Error number: ; Symbol: ; SQLSTATE:

    Message: Incorrect parameter or combination of parameters for START SLAVE UNTIL

  • Error number: ; Symbol: ; SQLSTATE:

    Message: It is recommended to use --skip-replica-start when doing step-by-step replication with START SLAVE UNTIL; otherwise, general error sql error 144, you will get problems if you get an unexpected slave's mysqld restart

  • Error number: ; Symbol: ; SQLSTATE:

    Message: SQL thread is not to be started so UNTIL options are ignored

  • Error number: ; Symbol: ; SQLSTATE:

    Message: Incorrect index name '%s'

  • Error number: ; Symbol: ; SQLSTATE:

    Message: Incorrect catalog name '%s'

  • Error number: ; Symbol: ; SQLSTATE:

    Message: Query cache failed to set size %lu; new query cache size is %lu

    was removed after

  • Error number: ; Symbol: ; SQLSTATE:

    Message: Column '%s' cannot be part of FULLTEXT index

  • Error number: ; Symbol: ; SQLSTATE:

    Message: Unknown key cache '%s'

  • Error number: ; Symbol: ; SQLSTATE:

    Message: MySQL is started in --skip-name-resolve mode; you must restart it without this switch for this grant to work

  • Error number: ; Symbol: ; SQLSTATE:

    Message: Unknown storage engine '%s'

  • Error number: ; Symbol: ; SQLSTATE:

    Message: '%s' is deprecated and will be removed in a future release, general error sql error 144. Please use %s instead

  • Error number: ; Symbol: ; SQLSTATE:

    Message: The target table %s of the %s is not updatable

  • Error number: ; Symbol: ; SQLSTATE:

    Message: The '%s' feature is disabled; you need MySQL built with '%s' to have it working

  • Error number: ; Symbol: ; SQLSTATE:

    Message: The MySQL server is running with the %s option so it cannot execute this statement

  • Error number: ; Symbol: ; SQLSTATE:

    Message: Column '%s' has duplicated value '%s' in %s

  • Error number: ; Symbol: ; SQLSTATE:

    Message: Truncated incorrect %s value: '%s'

  • Error number: ; Symbol: ; SQLSTATE:

    Message: Invalid ON UPDATE clause for '%s' column

  • Error number: ; Symbol: ; SQLSTATE:

    Message: This command is not supported in the prepared statement protocol yet

  • Error number: ; Symbol: ; SQLSTATE:

    Message: Got error %d '%s' from %s

  • Error number: ; Symbol: ; SQLSTATE:

    Message: Got temporary error %d '%s' from %s

  • Error number: ; Symbol: ; SQLSTATE:

    Message: Unknown or incorrect time zone: '%s'

  • Error number: ; Symbol: ; SQLSTATE:

    Message: Invalid TIMESTAMP value in column '%s' at row %ld

  • Error number: ; Symbol: ; SQLSTATE:

    Message: Invalid %s character string: '%s'

  • Error number: ; Symbol: ; SQLSTATE:

    Message: Result of %s() was larger than max_allowed_packet (%ld) - truncated

  • Error number: ; Symbol: ; SQLSTATE:

    Message: Conflicting declarations: '%s%s' and '%s%s'

  • Error number: ; Symbol: ; SQLSTATE:

    Message: Can't create a %s from within another stored routine

  • Error number: ; Symbol: ; SQLSTATE:

    Message: %s %s already exists

  • Error number: ; Symbol: ; SQLSTATE:

    Message: %s %s does not 6th master harddisk error

  • Error number: ; Symbol: ; SQLSTATE:

    Message: Failed to DROP %s %s

  • Error number: ; Symbol: ; SQLSTATE:

    Message: Failed to CREATE %s %s

  • Error number: ; Symbol: ; SQLSTATE:

    Message: %s with no matching label: %s

  • Error number: ; Symbol: ; SQLSTATE:

    Message: Redefining label %s

  • Error number: ; Symbol: ; SQLSTATE:

    Message: End-label %s without match

  • Error number: ; Symbol: ; SQLSTATE:

    Message: Referring to uninitialized variable %s

  • Error number: ; Symbol: ; SQLSTATE:

    Message: PROCEDURE %s can't return a result set in the given context

  • Error number: ; Symbol: ; SQLSTATE:

    Message: RETURN is only allowed in a FUNCTION

  • Error number: ; Symbol: ; SQLSTATE:

    Message: %s is not allowed in stored procedures

  • Error number: ; Symbol: ; SQLSTATE:

    Message: The update log is deprecated and replaced by the binary log; SET SQL_LOG_UPDATE has been ignored, general error sql error 144.

  • Error number: ; Symbol: ; SQLSTATE:

    Message: The update internal error 700 is deprecated and replaced by the autocad error aborting 2002 log; SET SQL_LOG_UPDATE has been translated to SET SQL_LOG_BIN.

  • Error number: ; Symbol: ; SQLSTATE:

    Message: Query execution was interrupted

  • Error number: ; Symbol: ; SQLSTATE:

    Message: Incorrect number of arguments for %s %s; expected %u, got %u

  • Error number: ; Symbol: ; SQLSTATE:

    Message: Undefined CONDITION: %s

  • Error number: ; Symbol: ; SQLSTATE:

    Message: No RETURN found in FUNCTION %s

  • Error number: ; Symbol: ; SQLSTATE:

    Message: FUNCTION %s ended without RETURN

  • Error number: ; Symbol: ; SQLSTATE:

    Message: Cursor statement must be a SELECT

  • Error number: ; Symbol: ; SQLSTATE:

    Message: Cursor SELECT must not have INTO

  • Error number: ; Symbol: ; SQLSTATE:

    Message: Undefined CURSOR: %s

  • Error number: ; Symbol: ; SQLSTATE:

    Message: Cursor is already open

  • Error number: ; Symbol: ; SQLSTATE:

    Message: Cursor is not open

  • Error number: ; Symbol: ; SQLSTATE:

    Message: Undeclared variable: %s

  • Error number: ; Symbol: ; SQLSTATE:

    Message: Incorrect number of FETCH variables

  • Error number: ; Symbol: ; SQLSTATE:

    Message: No data - zero rows fetched, selected, or processed

  • Error number: ; Symbol: ; SQLSTATE:

    Message: Duplicate parameter: %s

  • Error number: ; Symbol: ; SQLSTATE:

    Message: Duplicate variable: %s

  • Error number: ; Symbol: ; SQLSTATE:

    Message: Duplicate condition: %s

  • Error number: canon mp210 e27 error Symbol: ; SQLSTATE:

    Message: Duplicate cursor: %s

  • Error number: ; Symbol: ; SQLSTATE:

    Message: Failed to ALTER %s %s

  • Error number: ; Symbol: ; SQLSTATE:

    Message: Subquery value not supported

  • Error number: ; Symbol: ; SQLSTATE:

    Message: %s is not allowed in stored function or trigger

  • Error number: ; Symbol: ; SQLSTATE:

    Message: Variable or condition declaration after cursor or handler declaration

  • Error number: ; Symbol: ; SQLSTATE:

    Message: Cursor declaration after handler declaration

  • Error number: ; Symbol: ; SQLSTATE:

    Message: Case not found for CASE statement

  • Error number: ; Symbol: ; SQLSTATE:

    Message: Configuration file '%s' is too big

  • Error number: ; Symbol: ; SQLSTATE:

    Message: Malformed file type header in file '%s'

  • Error number: ; Symbol: ; SQLSTATE:

    Message: Unexpected end of file while parsing comment '%s'

  • Error number: ; Symbol: ; SQLSTATE:

    Message: Error while parsing parameter '%s' (line: '%s')

  • Error number: ; Symbol: ; SQLSTATE:

    Message: Unexpected end of file while skipping unknown parameter '%s'

  • Error number: ; Symbol: ; SQLSTATE:

    Message: EXPLAIN/SHOW can not be issued; lacking privileges for underlying table

  • Error number: ; Symbol: ; SQLSTATE:

    Message: '%s.%s' is not %s

    The named object is incorrect for the type of operation attempted on it. It must be an object of the named type. Example: requires a base table, not a view. It fails if attempted on an table that is implemented as a view on data dictionary tables.

  • Error number: ; Symbol: ; SQLSTATE:

    Message: Column '%s' is not updatable

  • Error number: ; Symbol: ; SQLSTATE:

    Message: View's SELECT contains a '%s' clause

  • Error number: ; Symbol: ; SQLSTATE:

    Message: View's SELECT contains a variable or parameter

  • Error number: ; Symbol: ; SQLSTATE:

    Message: View's SELECT refers to a temporary table '%s'

  • Error number: ; Symbol: ; SQLSTATE:

    Message: In definition of view, derived table or common table expression, SELECT list and column names list have different column counts

  • Error number: ; Symbol: ; SQLSTATE:

    Message: View merge algorithm can't be used here for now (assumed undefined algorithm)

  • Error number: ; Symbol: ; SQLSTATE:

    Message: View being updated does not have complete key of underlying table in it

  • Error number: ; Symbol: ; SQLSTATE:

    Message: View '%s.%s' references invalid table(s) or column(s) or function(s) or definer/invoker of view lack rights to use them

  • Error number: ; Symbol: ; SQLSTATE:

    Message: Can't drop or alter a %s from within another stored routine

  • Error number: ; Symbol: ; SQLSTATE:

    Message: Trigger already exists

  • Error number: ; Symbol: ; SQLSTATE:

    Message: Trigger does not exist

  • Error number: ; Symbol: ; SQLSTATE:

    Message: Trigger's '%s' is view or temporary table

  • Error number: ; Symbol: ; SQLSTATE:

    Message: Updating of %s row is not allowed in %strigger

  • Error number: ; Symbol: ; SQLSTATE:

    Message: There is no %s row in %s trigger

  • Error number: ; Symbol: ; SQLSTATE:

    Message: Field '%s' doesn't have a default value

  • Error number: ; Symbol: ; SQLSTATE:

    Message: Division by 0

  • Error number: ; Symbol: ; SQLSTATE:

    Message: Incorrect %s value: '%s' for column '%s' at row %ld

  • Error number: ; Symbol: ; SQLSTATE:

    Message: Illegal %s '%s' value found during parsing

  • Error number: ; Symbol: ; SQLSTATE:

    Message: CHECK OPTION on non-updatable view '%s.%s'

  • Error number: ; Symbol: ; SQLSTATE:

    Message: CHECK OPTION failed '%s.%s'

  • Error number: ; Symbol: ; SQLSTATE:

    Message: %s command denied to user '%s'@'%s' for routine '%s'

  • Error number: ; Symbol: ; SQLSTATE:

    Message: Failed purging old relay logs: %s

  • Error number: ; Symbol: ; SQLSTATE:

    Message: Target log not found in binlog index

  • Error number: ; Symbol: ; SQLSTATE:

    Message: I/O error reading log index file

  • Error number: ; Symbol: ; SQLSTATE:

    Message: Server configuration does not permit binlog purge

  • Error number: ; Symbol: ; SQLSTATE:

    Message: Failed on fseek()

  • Error number:

  • 0RAISERROR executed: %1Error opening cursorINSERT/DELETE on cursor can modify only one tableA log is required for IQ databasesCOMMIT/ROLLBACK not allowed within trigger actionsSyntax error near '%1' %2Syntax error, cannot specify IQ specific options without specifying IQ PATHThere is no way to join to '%1'Foreign key name '%1' not foundTrigger definition conflicts with existing triggersInvalid REFERENCES clause in trigger definitionGRANT of column permission on view not allowedSubquery allowed only one SELECT list itemCannot delete or rename a column referenced in a trigger definitionIdentifier '%1' too longFunction or column reference to '%1' in the ORDER BY clause is invalidInvalid ORDER BY specificationLabel '%1' not foundThere is already a variable named '%1'Variable '%1' not foundData definition statements not allowed in procedures or general error sql error 144 option '%1' -- no PUBLIC setting existsWrong number of parameters to function '%1'Transact-SQL feature not supportedUnknown terrorist takedown 2 patch '%1'Invalid column numberParameter name missing in call to procedure '%1'Parameter '%1' not found in procedure '%2'Signature '%1' does not match procedure parametersSelect lists in UNION, INTERSECT, or EXCEPT do not match in lengthMore columns are being dropped from table '%1' than are definedColumn '%1' not foundCorrelation name '%1' not foundColumn '%1' found in more than one table or it is used more than once in the SELECT list -- it needs a correlation nameDerived table '%1' has no name for column %2Wrong number of values for INSERTProcedure or trigger calls have nested too deeplyValue %1 out of range for destinationCannot modify column '%1' in table '%2'Cannot update an expressionColumn '%1' in table '%2' cannot be NULLNumber of columns allowing NULLs exceeds limitCannot convert %1 to a %2Return type of void from procedure '%1' cannot be used in any expressionPermission denied: %1Duplicate insert columnREADTEXT or WRITETEXT statement cannot refer to a viewThere is more than one way to join '%1' to '%2'Invalid expression in WHERE clause of Transact-SQL outer joinThere is no way to join '%1' to '%2'Invalid join type used with Transact-SQL outer joinCannot uniquely identify rows in cursorOperation would cause a group cycleTable '%1' is in an outer join cycleTable '%1' requires a unique correlation nameFeature '%1' not implementedLanguage extensionInvalid expression near '%1'Too many arguments for function or procedure '%1'Statement size or complexity exceeds server limitsNull value eliminated in aggregate functionArgument %1 of procedure '%2' cannot be NULLProcedure '%1' not foundUser ID '%1' does not existSubquery cannot return more than one rowInvalid data conversionRow has been updated since last time readValue for column '%1' in table '%2' has changedDisallowed language extension detected in syntax near '%1' on line %2No primary key value for foreign key '%1' in table '%2'Primary key for row in table '%1' is referenced by foreign key '%2' in table '%3'Table '%1' has a foreign key with a referential actionIndex '%1' for table '%2' would not be uniqueConstraint '%1' violated: Invalid value for column '%2' in table '%3'Constraint '%1' violated: Invalid value in table '%2'The specified foreign key (%1) cannot be enforcedWITH CHECK OPTION violated for insert/update general error sql error 144 base table '%1'Wrong number of variables in FETCHRow has changed since last read -- operation canceledCursor not in a valid stateCursor has not been declaredCursor already openCursor not openRow not foundNo current row of cursorPassword must be at least %1 charactersStatement cannot be executedInvalid SQL descriptor nameUnable to start database serverNot enough memory to startUnable to start database server: missing license fileSpecified local connection ID not foundLocal connection ID does not refer to the current databaseCannot close a remote JDBC connection that is not the current connectionUnable to start specified database: %1Database name required to start serverUnable to start specified database: '%1' is an invalid transaction log mirrorUnable to start specified database: The transaction log '%1' or its mirror '%2' is invalidUnable to start specified database: '%1' not expecting any operations in transaction logUnable to start specified database: Unknown encryption algorithmUnable to start specified database: '%1' must be upgraded to start with this server (capability %2 missing)Unable to start specified database: Cannot use log file '%1' since it has been used more recently than the database fileUnable to start specified database: '%1': transaction log file not foundUnable to start specified database: Cannot use log file '%1' since the offsets do not match the offsets in the database fileUnable to start specified database: Cannot use log file '%1' since the database file has been used more recentlyUnable to start specified database: Cannot use log file '%1' since it is shorter than expectedUnable to start specified database: '%1' is not a databaseUnable to start specified database: '%1' was created by a different version of the softwareUnable to start specified database: '%1' is not a valid database fileUnable to start specified database: '%1' is an invalid transaction logUnable to start database %1: Cannot use read-only mode if auditing is enabledDatabase '%1' cannot be started on this platform. See sprers.euDatabase '%1' cannot be started on this platform. See sprers.euSpecified database not foundSpecified database file already in useDatabase page size too big: %1Invalid database page sizeDatabase creation failed: %1Internal rollback log corruptedRequest denied -- no active databasesThe selected database is currently inactiveDeadlock detectedAll threads are blockedRollback occurred due to deadlock during prefetchDatabase server connection limit exceededCommunication errorClient/server communications general error sql error 144 version mismatchToo many columns in tableReferential integrity actions other than RESTRICT not allowed for temporary tablesTables related by key constraint must both general error sql error 144 permanent, or both be temporary and not created with ON COMMIT DELETE ROWS. For global temporary tables they must both be shared if one is sharedKey constraint between temporary tables requires a primary key (not unique constraint)Table '%1' has no primary keyColumn '%1' in foreign key has a different definition than primary keyDatabase name not uniqueDbspace '%1' not foundDuplicate referencing sleep terror disorder relation with macbeth key column '%1' already definedForeign key '%1' for table '%2' duplicates an existing foreign keyIndex name '%1' not uniqueIndex name '%1' is ambiguousTable cannot have two primary keysTable already has a primary keyCannot open transaction log file -- %1Primary key for table '%1' is not unique: Primary key value ('%2')Table '%1' not foundUser-defined type '%1' not foundUnable to find in index '%1' for table '%2'Error number %1 for RAISERROR must not be less than User message %1 not foundFormat string argument number %1 is invalidI/O error %1 -- transaction rolled backMemory error -- transaction rolled backUnknown backup operationDatabase backup not startedIncomplete transactions prevent transaction log renamingInvalid backup operationDatabase upgrade failedDatabase upgrade not possibleTerminated by user -- transaction rolled backDisk full '%1' -- transaction rolled backError writing to transaction log fileStatement interrupted by userTable in useProcedure in use by '%1'User owns procedures in useUser owns tables in useCan only describe a SELECT statementDatabase cannot be started -- %1Specified database is invalidNo database file specifiedInvalid user ID or passwordInvalid user ID or password on preprocessed moduleThe synchronization failed because MobiLink returned authentication status '%1' with value '%2'Connection not foundConnections to database have been disabledConnection was terminatedCannot insert or update computed column '%1'Number of columns defined for the view does not match SELECT statementView references '%1', which is a temporary general error sql error 144. Views can only refer to permanent objectsTRUNCATE TABLE statement cannot be used on a viewTable general error sql error 144 be emptyCannot alter a column in an indexA dbspace has reached its maximum file sizeThe server attempted to access a page beyond the end of the maximum allowable dbspace file sizeLanguage extension detected in syntax near '%1' on line %2Invalid setting for option '%1''%1' is an invalid value for '%2'Invalid database server command lineInvalid parameterInvalid local database optionParse error: %1Parse error: %1Only the DBA can set the option '%1'The option '%1' can only be set as a temporary optionThe option '%1' cannot be set from within a procedureThere are still active database connectionsRequest to start/stop database deniedCannot find index named '%1'Invalid absolute or relative offset in FETCHCannot update column '%1' since it appears in the ORDER BY clauseSavepoint '%1' not foundInvalid TEXTPTR value used with WRITETEXT or READTEXTInvalid data type for column in WRITETEXT or READTEXTInvalid host variableDatabase server not running in multi-user modeUpdate operation attempted on non-updatable queryFOR UPDATE has been incorrectly specified for a READ ONLY cursorFunction or column reference to '%1' must also appear in a GROUP BYValue truncatedUpdate operation attempted on non-updatable remote queryMore than one table is identified as '%1'The specified transaction isolation is invalidInvalid escape sequence '%1'The pattern is too longInvalid escape character '%1'Update operation attempted on a read-only cursorCannot update column '%1' since it does not appear in the SELECT clauseDatabase server not foundDatabase server already runningInvalid descriptor indexError in assignmentUser '%1' has the row in '%2' lockedDynamic memory exhaustedRight truncation of string dataIllegal cursor operation attemptTrigger '%1' not foundExpression has unsupported data typeThe remote server does not support an auto-incrementing data typeCreating remote tables with computed columns is not supportedThe data type of column or variable '%1' is not supportedUnable to connect to server '%1': %2Could not access column information for the table '%1'The column '%1' does not exist in the remote tableThe data type specified for column '%1' is not compatible with the actual data typeThe length specified for column '%1' is different than the actual lengthNULL attribute mismatch for column '%1'Identity attribute mismatch for column '%1'Remote server '%1' could not be foundThe remote table '%1' could not be foundThe table specification '%1' identifies more than one remote tableExternal login for server '%1' could not be foundRemote server does not have the ability to support this statementRemote server '%1' is currently configured as read-onlyItem '%1' already existsThe specified session name '%1' is not validTrace event '%1' already existsToo many arguments for trace event '%1'Trace bcbsmp.lib link error session '%1' is active. Stop active session before dropping the sessionTrace event '%1' is not validDropping or altering arbiter "%1" requires a connection to the partnerTrace event '%1' is referenced by one or more sessions. Drop referencing sessions firstThe UltraLite database deploy file is invalid (code: %1, file: %2)Unable to copy file %1Unable to create directory %1File %1 already existsUnable to delete file %1Outer references are not allowed for TPF input tablesThe V4 C/C++ APIs are not supported for this databaseMultiple table parameters are not supportedThe transaction may not be committed because the primary server lost quorumUnable to copy file %1 to destination %2You cannot use a security token when making remote connectionsInvalid tool name or admin user for generating security tokenUnable to load the dbrsakp shared objectServer name can only be specified when connecting to a cloud database server general error sql error 144 NODETYPE=DIRECTDatabase name must be specified when connecting to a cloud database serverFailed to load the MobiLink client support librariesExternal procedures or functions are not allowed across server typesTable parameterized functions are not allowed across server typesExternal environment cannot be started, external process terminated on start upExternal environment cannot be started during database startupExternal environment failed to start and establish a connection within the %1 second timeoutLogin redirection is required general error sql error 144 complete the connection, but it is not supported by the clientFailed to transform point %1 (error %2)Geometry expressions cannot be used in the ORDER BY specification (near '%1')Format '%1' is not supported in the UNLOAD statementOuter reference not permitted in DML derived tableText index %1 cannot be used with text procedure %2Database needs to be upgraded to support the use of external libraries with text indexesThe intermediate point (%3) of the ST_CircularString segment between general error sql error 144 and %2 is collinear with but not between the start and end pointsSupport for spatial is not available for this CPUText index with external prefilter cannot contain both binary and string columnsText indexes are not allowed across server typesThe materialized view cannot be changed to immediate because the primary key columns of any table in the preserved side of an OUTER JOIN must exist in the SELECT listThe materialized view cannot be changed to ide 1 error because at least one non-nullable column from any null-supplying side of an OUTER JOIN must exist in the SELECT listThe materialized view cannot be changed to immediate because the ON conditions refer to tables which are not in the null-supplying and preserved sides of the OUTER JOINsUnknown collation '%1'Database contains no tables to synchronizeVERIFY and RENAME cannot be used togetherUsing temporary tableCannot specify range that excludes next value for sequence %1CircularString with 3 points has been converted to use 5 general error sql error 144 ring order has been reorientedPosition %1 is invalid (should be between %2 and %3)Invalid polygon: ring is larger than allowed for SRID=%1 (near '%2')Invalid polygon: curve is not a ringInvalid polygon: ring has zero area (near '%1')Invalid polygon: ring is not closed (near '%1')Value %1 out of range for coordinate %2 (SRS bounds [%3, %4] exceeded by more than 50%)LineString must contain at least 2 points (near '%1')Curve contains nearly antipodal points %1 and %2 (near '%3')An internal error has occurred in the spatial libraryAn expression of type %1 is not union-compatible with type %2ST_Geometry arguments not supported by SQL function %1The SRID %1 does not identify a geographic spatial reference systemSRID %1 is referenced by domain "%3"."%2"SRID %1 is referenced by parameter '%2' of procedure '%3'SRID %1 is referenced by column '%2' of table '%3'Spatial unit of measure "%1" is reservedSpatial reference system "%1" is reservedSpatial reference system %1 cannot be modified because it is in useInvalid storage format '%1'The specified polygon format '%1' is not supported for this type of spatial reference systemThe specified axis order is not supported for this type of spatial reference systemCoordinate bounds missing for coordinate %1Ellipsoid parameters specified for non-geographic spatial reference systemEllipsoid parameters missing for geographic spatial reference systemThe spatial reference system type is not supported ('%1')Error parsing definition string '%1'Spatial reference system must specify the SRID to useSpatial reference system '%1' already existsUnit of measure '%1' already existsSpatial reference system '%1' not foundUnit of measure '%1' not foundThe string '%1' is not a valid coordinate nameThe string '%1' is not a valid axis orderThe CONVERT USING clause must be specified when creating a unit of measureSpatial column '%1' cannot be included in an index because it is not constrained to a single SRIDSpatial column '%1' cannot be included in a primary key or unique indexTable '%1' contains a spatial column '%2' and no primary keyInvalid polygon: multiple exterior ringsInvalid polygon nestingInvalid polygon: no exterior ringInvalid polygon format '%1'Unit of measure "%1" is not an angular unitUnit of measure "%1" is not a linear unitTransform from General error sql error 144 %1 not supportedTransform from SRID %1 to %2 not supportedTransform definition is too longInvalid transform definition '%1'Invalid spatial reference system well-known-text (WKT)The comparison '%1' cannot be used with geometriesInvalid configuration name %1Error reading configuration fileMirror server "%1" defined with type COPY does not include a parent definitionA geometry with SRID=%1 is not supported when computing distance between non-point geometriesA geometry with SRID=%1 is not supported for method %2The data is not in a recognized formatThe value '%2' is not a valid setting for the '%1' format specification optionThe format specification option '%1' is not recognizedThe format specification syntax is invalidAn input string in '%1' format cannot be used hereThe format type '%1' cannot be used hereThe format type '%1' is not recognizedThe embedded SRID are inconsistent (%1 and %2)The embedded SRID (%1) conflicts with the provided SRID (%2)The multi patch shapefile shape is not supportedInvalid shapefile filenameError parsing shapefile attributesError toshiba laptop bios error shapefile recordError parsing well-known-binary (WKB): invalid byte order mark %1 at offset %2Error parsing well-known-binary (WKB): inconsistent dimensions at offset %1Error parsing well-known-binary (WKB): unexpected end of inputError parsing well-known-binary (WKB): type code %1 at offset %2 is not a valid subtype of the parentError parsing well-known-binary (WKB): type code %1 at offset %2 is invalidError from external library: -%1: %2Error parsing geometry internal serialization at offset %1Error parsing well-known-text (WKT): inconsistent dimensions at offset %1Spatial feature %1 is not supportedSupport for spatial is not available for this databaseCannot convert from %1 to %2 (near %3)An ST_CircularString cannot be constructed from %1 points (near '%2')Unknown spatial reference system (%1)Mixed coordinate dimensionsError parsing well-known-binary (WKB) at offset %1Error parsing well-known-text (WKT) scanning '%1' at offset %2Failed to transform geometry (error %1)Unknown unit of measure '%1'Non-contiguous curves near '%1'Mixed spatial reference systems %1 and %2 (near %3)Element is an general error sql error 144 set (near '%1')Point is duplicated %1Invalid intersection matrix '%1'The definition of temporary table '%1' has changed since last usedInvalid external term breaker name specifiedInvalid external prefilter name specifiedError initializing external term breakerUnique indexes with the clause WITH NULLS NOT DISTINCT are not supported for this databaseError initializing external prefilterThe value for the stoplist cannot be NULLAn incremental refresh is not possible when communication error minecraft 1.8 are exhaustedFailed to start the dbmlsync server. Check the dbmlsync log file for more detailsInvalid stoplist valueFailed to shut down the dbmlsync server, general error sql error 144. Check the dbmlsync log file for more detailsFailed to connect to the dbmlsync server. Check the dbmlsync log file for more detailsSynchronization failed. Check the dbmlsync error e13 canon mp280 file for more detailsUnable to stop specified database: %1The licensed maximum number of mirror servers with type COPY has been exceededDownload general error sql error 144 due to an invalid or unsupported row valueDatabase server name '%1' cannot be the same as either the primary or mirror serverClient redirected more than onceSynchronization failed with internal error: %1The server is not able to establish TCP/IP connectionsSynchronization failed. Check the results of the call to sp_get_last_synchronize_result( %1 ) for more informationThe materialized view cannot be changed to immediate because the ON conditions must refer to both sides of the OUTER JOINFailed to start the dbmlsync serverFailed to connect to the dbmlsync serverText queries cannot contain more than termsSequence generators are not supported for this databaseThe SYNCHRONIZE statement timed outThe database server failed to shut down the dbmlsync serverUser owns sequences in useThe dbmlsync server failed to shut down in a timely mannerSequence '%1' in use by another connectionOperation not supported for ST_GeomCollection with intersecting elements (near "%1")Could not create a text index without external prefilter library on column "%1"The 'currval' operator is not defined yet for sequence '%1' for this connectionCannot treat value '%1' as type %2. The dynamic type is %3TREAT AS can only be used with extended types. Cannot treat %1 as a %2Cannot assign automatic mirror server parent

    Resolved General Error: SQL ERROR [ mysqli ]

    Hi
    I have a problem converting the forum to another platform, general error sql error 144. It's a mistake:
    My forum is on your web hosting.


    Information

    General Error:
    SQL ERROR [ mysqli ]

    Table 'forum_sprers.eu_userconv' doesn't exist []

    SQL

    SELECT username_clean FROM phpbb_userconv GROUP BY username_clean HAVING COUNT(user_id) > 1
    in file /var/www/vhosts/sprers.eu line

    BACKTRACE

    FILE: (not given by php)
    LINE: (not given by php)
    CALL: installer_msg_handler()

    FILE: [ROOT]/phpbb/db/driver/sprers.eu
    LINE:
    CALL: trigger_error()

    FILE: [ROOT]/phpbb/db/driver/sprers.eu
    LINE:
    CALL: phpbb\db\driver\driver->sql_error()

    FILE: [ROOT]/install/convertors/functions_phpbbphp
    LINE:
    CALL: phpbb\db\driver\mysqli->sql_query()

    FILE: [ROOT]/install/convert/sprers.eu() : eval()'d code
    LINE: 1
    CALL: phpbb_check_username_collisions()

    FILE: [ROOT]/install/convert/sprers.eu
    LINE:
    CALL: eval()

    FILE: [ROOT]/install/convert/controller/sprers.eu
    LINE:
    CALL: phpbb\convert\convertor->convert_data()

    FILE: (not given by php)
    LINE: (not given by php)
    CALL: phpbb\convert\controller\convertor->convert()

    FILE: [ROOT]/vendor/symfony/http-kernel/sprers.eu
    LINE:
    CALL: call_user_func_array()

    FILE: [ROOT]/vendor/symfony/http-kernel/sprers.eu
    LINE: 64
    CALL: Symfony\Component\HttpKernel\HttpKernel->handleRaw()

    FILE: [ROOT]/install/sprers.eu
    LINE: 61
    CALL: Symfony\Component\HttpKernel\HttpKernel->handle()


    mBLYdISJq0H8Wirm9LMeWgCot


    PtA5TebRxxuVdJRKooYCZa

     

    Encountered internal error in SQL ENGINE in sts_sprers.eu

    Disclaimer

    The origins of the information on this site may be internal or external to Progress Software Corporation (“Progress”). Progress Software Corporation makes all reasonable efforts to verify this information. However, the information provided is for your information only. Progress Software Corporation makes no explicit or implied claims to the validity of this information.

    Any sample code provided error code 1 this site is not supported under any Progress support program or service. The sample code is provided on an "AS IS" basis. Progress makes no warranties, express or implied, and disclaims all implied warranties including, without limitation, the implied warranties of merchantability or of fitness for a particular purpose. The entire risk arising out of the use or performance of the sample code is borne by the user. In no event shall Progress, its employees, or anyone else involved in the creation, general error sql error 144, production, or delivery of the code be liable for any damages whatsoever (including, without limitation, damages for loss of business profits, business interruption, loss of business information, or other pecuniary loss) arising out of the use of or inability to use the sql goto error code, even if Progress has been advised of the possibility of such damages.

    MyBB SQL Error

    MyBB has experienced an internal SQL error and cannot continue.
    SQL Error - Table './foro/mybb_sessions' is marked as crashed and last (automatic?) repair failedQuery:DELETE FROM mybb_sessions WHERE uid='2'
    Please contact the MyBB Group for technical support.


    Versión de MyBB


    Versión PHP
    +ubuntu+sprers.eu+1

    Motor SQL
    MySQLi


    Plugins activos

    Plugin
    ControlesMyBB AJAX Chat ()
    Adds a chat room to every page of your forum

    Google SEO ()
    Google Search Engine Optimization as described in the official Google's 
    [size=undefined]PHP and Template Conditionals()
    Allows you to use conditionals and PHP code in templates.
    [Image: sprers.eu] ProStats [color=#]/proʊˈstæts/ ()
    Professional stats for MyBB, general error sql error 144. ]


    no changes in recent months

    I have tried to repair from mybb admin and from Phpmyadmin but without success.

    there is no Index in that table

    sprers.eu

    admin panel works correctly
    thank you for dedicating part of your time

    Fixed

    sprers.eu

    REPAIR TABLE 'mybb_sessions';

    I received emails equal to this, after fixing the table

    Your copy of MyBB running on Foro sprers.eu (sprers.eu) has experienced an error. Details of the error include:

    Type: 20
    File: (Line no. 0)
    Message
    SQL Error: - Got error from storage engine
    Query: DELETE FROM mybb_sessions WHERE ip=X'bdfee'

    How to prevent 'table is mark as and last (automatic) repair failed'?

    This is the second time within the last 4 days that one of the tables in my database got corrupted. The is the error that I have seen in my apache log:

    PHP Fatal error: Uncaught exception 'PDOException' with message 'SQLSTATE[HY]: General error: Table [TABLE_NAME] is marked as crashed and last (automatic?) repair failed'

    I managed to repair it manually using:

    but of course this is not a long term solution.

    I need to understand why is this happening, general error sql error 144, so I can prevent it from happening again in the future.

    • Total database size is 2Gb, tables, million rows.
    • The table where it happened is the largest in the database: million rows, general error sql error 144, Mb.
    • Server version:
    • ubuntu
    • PHP
    • I checked and there was enough free disk space. About ram, it was not an issue so far.
    • The host where the db reside is sprers.eu (8Gb ram)

    The database sits in the server harddisk. I am thinking about moving it to RDS, I wonder if that would help.

    What do you suggest I should do? Any way to analyze mysql and understand where is the problem?

    UPDATE

    /var/log/mysql/sprers.eu has this in it:

    found this in my syslog

    Like I said before, my server is sprers.eu with 8Gb RAM. Normal utilization is pretty low. I think there was a backup process that was running, maybe it could have caused higher resource utilization.

    Any suggestions how to check further?

    0 Comments

    Leave a Comment