Error stray 302 in program

error stray  302 in program

Answer: this kind of error, the possibility program itself does not have syntax error, should be the code of each line space is wrong, just need. ubuntu c compilation error: stray'\302' in program. This is due to the presence of hidden non-ASCILL characters. (Due to direct copying from wps). forum.arduino.cc › Using Arduino › Programming Questions. error stray  302 in program

Error stray 302 in program - your place

[Solved] Error message "error: stray '\302' in program"

Jazor He Asks: Ubuntu systemctl service fails with: Main process exited, code=exited, status=1/FAILURE
I am writing a python script that subscribes to some MQTT topics to localhost MQTT broker and when a message is pushed, the script will call a function in another script on the same directory to load the changes into an SQL database.

The script is working fine when run manually in terminal:



However, I am trying to make this file execute automatically on Ubuntu system startup. I have created in a new service in:



The service description goes as follow:

Code:


I also enabled the service and tried starting the service using:



and



When rebooting the machine and also try running the service manually, I get the folling messages:

Code:


I did some research and found that this type of error could be related to calling the service too early before some required device has been loaded. Thus I tried altering the to and also to , however with no luck, service still exited with the same error messages.

Because the service does not fully execute even when I run manually, so I suspect this is not due to another service not being loaded in time. It is some other reason. But I could not figure out why.

I am happy to also post the python script if needed.

Thanks.

SolveForum.com may not be responsible for the answers or solutions given to any question asked by the users. All Answers or responses are user generated answers and we do not have proof of its validity or correctness. Please vote for the answer that helped you in order to help others find out which is the most helpful answer. Questions labeled as solved may be solved or may not be solved depending on the type of question and the date posted for some posts may be scheduled to be deleted periodically. Do not hesitate to share your thoughts here to help others.

Click to expand...

What is error stray 302 in Program C++?

Contents

What is error stray 302 in Program C++?

Now whenever I write an equals sign, followed by a space (something like width = 100) I get the error message: stray ‘\302’ in program. I know this error means that there is a non-standard character in the text file. When I delete the space character, the program compiles just fine.

What does stray 302 mean?

It means you have a weird character (302 is its representation) in your code. Search for Shift+space for example which is a spacenolinebreak character you might have gotten in your program by copying and pasting from the webpage or fat finger when you typed in your code.

What is stray error in C++?

The reason for this is that your code might contain some hidden octal (not-readable) characters which the compiler cant understand and you can not see. They are present in your code because you have perhaps copied it from somewhere. So, simply you can retype the same code to solve the problem.

What does stray 303 mean?

You are using some bizarre symbol × in literals like 0×FF14E7 . That’s your \303 . It is supposed to be 0xFF14E7 .

What is missing terminating character?

This Error: missing terminating (“) character is occurred, when a constant string or text is not closed in double quotes either you missed closing quotes or using singe quote instead of double quote while closing the string/text.

What is stray C?

Stray Error means you are Using an Invalid Character. So please Check Out Your Code for any special characters which may have been understood as some another character. Remove extra spaces and check valid names of functions,identifiers. Stray Error means you are Using an Invalid Character.

How do you fix a missing terminating character?

If string/text is not closed in double quotes, compiler throws this error. How to fix? In the first program, closing double quote is missing, and in the second program, text is closing by single quote instead of double quote. To fix this error, use double quote to close the string/text.

What causes a stray error in a program?

There is a number of causes for it. It is usual to see the following stray errors in your code, error stray ‘ 342’ in program. error stray ‘#’ in program. or stray ‘ 315’ in program. stray ‘\\’ in program . stray ‘\\302’ in program. error stray ‘ 240’ in program. It is quite frustrating to deal with all these errors.

What is the error ” \\ 302 ” in C-compilation?

The error I found is as follows: …. It is some piece of code I copied from a chat messenger. In Facebook Messenger, it was a special character only. After copying into the Vim editor it changed to the correct character only. But the compiler was giving the above error .. then .. that statement I wrote manually after .. it got resolved… 🙂

What causes a stray error on an Arduino?

One of the common errors you will see while programming your Arduino is a stray error. There is a number of causes for it. It is usual to see the following stray errors in your code, error stray ‘ 342’ in program.

What causes / ( 302 ) error on Arduino IDE?

One cause of the / (302) error is copy and paste code from a word processor. You have ASCII codes copied that add spaces, etc to your code. Go through each identified line and remove any extra spaces at the beginning and end of any identified line. Then, (Arduino IDE) go to TOOLS, Auto Format.

Error: stray '342' in program

Error: stray '342' in program

Stray\342 inprogram error: stray '\' in program with servo. 1. stray \342 in program.

If the error message referred to a stray \342 in the code it is most likely to have been caused by copying the code from a Web page which has Unicode characters in it. Until we see the complete error message we will not know. Incidentally, copying the code from this thread into the IDE and compiling it does not produce that error.

Like many text editors, gedit provides syntax highlighting for many programming languages including C (so different text in your program will shown in different colors to signify its meaning), which is a handy feature and makes a text editor much more convenient and user-friendly for programming than a word processor.

Error: stray '302' in program

One cause of the /(302) error is copy and paste code from a word processor. You have ASCII codes copied that add spaces, etc to your code. Go through each identified line and remove any extra spaces at the beginning and end of any identified line. Then, (Arduino IDE) go to TOOLS, Auto Format. At least, this cleared up the problem for me.

Because you save your files in a wrong encoding. GCC uses UTF-8 as default on most (all?) platforms. It doesn't take a BOM.

error: stray ‘\302’ in program 이러한 오류는 소스코드를 복사해오는과정에서 많이발생합니다. 저같은 경우는 아무리 원본과 비교해도 다른점이없는데 계속오류가 나서 답답해하곤 했습니다. 오류의 원인은 복사해올때 생긴 공백 입니다.

The problem is that you have Unicode quotation marks instead of ASCII quotation marks; probably your editor automatically changed them, or you copied the text from a site that does this automatically in its authoring software. Replace the quotes with normal ASCII quote (0x22, ") and it should work.

error stray '240 in program in c

Enjoy the videos and music you love, upload original content, and share it all with friends, family, and the world on YouTube.

Stray '343' in program

stray '\342' in program This report would have more information with "Show verbose output during compilation" option enabled in File -> Preferences.

Error: stray '210' in program

Stack Exchange network consists of 176 Q&A communities including Stack Overflow, the largest, most trusted online community for developers to learn, share their knowledge, and build their careers.

Remove the straying \240. :-) Open the source code with an editor which is able to show special chars. Like ‘vim’. Go to the line which is reported and you see the straying special char.

Stray 204 means it found some character that it didn't know what to do with. You probably copy-pasted this from some website and you picked up some extra characters from the html when you copied it. If you had read How to use this forum you would have known to post your code in code tags.

Stray error in Arduino is a very common type of error. This tutorial will teach you how to get rid of Stray '/342' '/302' '#' errors.

Error: stray meaning

But now it says "Error: Element dl is missing a required instance of child element dd. From line 40, column 5; to line 40, column 9 </dt>↩ </dl>↩↩↩ Content model for element dl: Either:Zero or more groups each consisting of one or more dt elements followed by one or more dd elements, optionally intermixed with script-supporting elements.

error: stray '\' in program. If you are getting error messages like above in your C/C++ program, then don't worry. ;-) Perhaps you have copied the code from somewhere. If your code is small ,then the simplest solution is that you should start typing it from zero.

stray definition: 1. to travel along a route that was not originally intended, or to move outside a limited area: 2…. Learn more.

stray '343' in program arduino

Looking for a Programming Arduino? Read Our Expert Review Before You Buy. Our Research Has Helped Over 200 Million People To Find The Best Products.

Browse & Discover Thousands of Computers & Internet Book Titles, for Less.

Stray '#' in program Arduino

75 of The Top 100 Retailers Can Be Found on eBay. Find Great Deals from the Top Retailers. Get Arduino With Fast and Free Shipping on eBay.

Error stray 321 in program

This is the explanation given per the HP website however it is not the case with my machine. There is nothing wrong with the receiving machines as the faxes go through with no problem from another machine.

The most common cause for this type of error is writing code in an environment such as Microsoft Word that autocorrects to add fancy quotes and fancy apostrophes, and then copy-pasting into a source file. Open your program in a hex editor such as Frhed and look for any byte value not in the range 00-7F. You may also be reversing the inputs and outputs in your command line invoking the compiler.


You Might Like:

240 Volt 3 wire split phase Ballast Bypass Wiring instructions and diagram Posted by Louse Lowman Deteriorates Zithromax Grouping Jaqui Strays Pnp Routines grammar and spelling errors Also be aware that entries in the following list. show you internal wiring of PIR sensor and light More electrical tips and dia.

NinaRouse 23 Y O female XXX hot live cam sex show Chat. Fatal error: Uncaught BadMethodCallException: Attempt to close a closed MaxMind DB. in. Duration: 5:00 available in: 720p 480p 360p 240p. wear fur and they think it's a status symbol Lee. pinay yopurn xhamdter odir stray x zooskool anushka dup.


In a trivial editor you only see nothing as espected like when you push the space key. The compiler doesn't understand non breakable space and complains about.

This tutorial shows what is wrong with the traditional method of Arduino programming and how Eventually can save you from the awful codemess that plagues all.

i have recently downloaded a sketch from internet and when i am veryfying it it was always showing error stray/302 in program.Pls tell me someone how to fix.

Those pretty common errors usually occur when a sketch is copied from a web page. They are invisible characters that the IDE does not recognize. A search of.

This is signaled to the host by setting the configuration error bit in the message data for the Command Processor T6 object. 11.2. Using the Object Protocol.

Linux C compiler program error stray '\ 302' or '\ 240' in program Solutions. This error is usually the source code contains a number of hidden nonascii.

Linux C compiler program error stray '\ 302' or '\ 240' in program Solutions. This error is usually the source code contains a number of hidden nonascii.

Linux C compiler program error stray '\ 302' or '\ 240' in program Solutions. This error is usually the source code contains a number of hidden nonascii.

Linux C compiler program error stray '\ 302' or '\ 240' in program Solutions This error is usually the source code contains a number of hidden nonascii.

Anthony C.Daly and Claude Pavur have been very generous in reading and commenting on drafts of the oral character of language and to some of the deeper.


When crosscompiling a C++ file with Raspberry Pi 3 an error is reported: Error 1 stray '\357' in program Error 2 stray '\273' in program Error 3 stray.

Stray 342 In Program Programming Questions Arduino Forum. How To Fix Stray Errors 273 277 302 357 In Arduino Youtube. Error Stray 240 In Program Stack.

Stray Error In Dev C Full; Stray Error In Dev C 4; Error Stray ' 240' In Program consists of 175 Q&A communities including Stack Overflow the largest.

How do supermarkets dispose of expired food? If there were ten commandments in cooking what would they be? Why do American winemakers produce mostly.

Acheve C Code Atoi Error Collection de photos. Error: stray '\240' in program Stack Overflow Use of C + + ifstream and error handling

error: stray '\' in program in c

error: stray '\' in program in c

It is worth mentioning here (for whoever lands on this page just like me) that this sort of error message error: stray ‘\xyz’ in program can appear with any other character or symbol that is not recognized by the compiler as a legal one.

error: stray '\' in program. If you are getting error messages like above in your C/C++ program, then don't worry. ;-) Perhaps you have copied the code from somewhere. If your code is small ,then the simplest solution is that you should start typing it from zero.

Go to the line which is reported and you see the straying special char. That happens if you had opend or edited you sourcecode with an editor that enters “non breakable spaces” instead of the common whitespace. That might happen if you push “shift-space” instead of only “space”, depending on the editor you use.

Like many text editors, gedit provides syntax highlighting for many programming languages including C (so different text in your program will shown in different colors to signify its meaning), which is a handy feature and makes a text editor much more convenient and user-friendly for programming than a word processor.

Well, it is because there are “ and ” instead of " (note the slant!), and these characters are not valid.

The C++ language require that the whole program uses mostly the ASCII encoding, except for the content of strings or character literals (that may be in a implementation-dependent encoding). So to fix your problem, make sure that you only use simple ASCII space, quotes, double quotes and not smart characters.

Error: stray '\240' in program is simply a character encoding error message. From my experience, it is just a matter of character encoding. For example, if you copy a piece of code from a web page or you first write it in a text editor before copying and pasting in an IDE, it can come with the character encoding of the source document or editor.

Look at the quotes in the "scanf()" call - those are "smart quotes", which your compiler does not recognize. As GReaper mentioned, there may be other stray invisible characters, as well.

get rid of all your white space, the characters hidden in the white space are producing your errors.. Also, check that the end of each line does not have a space after the ";".

error stray ' 302' in program c++

One cause of the / (302) error is copy and paste code from a word processor. You have ASCII codes copied that add spaces, etc to your code. Go through each identified line and remove any extra spaces at the beginning and end of any identified line. Then, (Arduino IDE) go to TOOLS, Auto Format.

stray error in arduino

Re: Compiling error: error: stray '\' in program. In typesetting there are multiple lengths of dash used for different purposes. The normal "hyphen" on your keyboard is used as a minus sign. You then also have the "em dash" and the "en dash" which are both longer than a standard keyboard minus sign.

stray.c:7: error: stray '\242' in program. stray.c:8: error: stray '\234' in program. If you are getting error messages like above in your C/C++ program, then don't worry. ;-) Perhaps you have copied the code from somewhere. If your code is small ,then the simplest solution is that you should start typing it from zero.

High Voltages is a place where you can find cool and innovative Arduino, Raspberrypi, python and ESP8266 tutorials.Check our tutorials.

Stop wasting time searching for quality tutorials and courses to help you learn. Instead. start learning, making, & enjoying Arduino with this straight-forward, no-nonsense guide.

error: stray 315 in program

“stray '/302' in program error” when compiling. 0. Uploading sketch problem. 0.


You Might Like:

ProgrammerAH.

When programming the AVR chips you can set a bit high or low by the cable as a stray voltage on a wrong pin can ruin the Atmel chip or your computer.

Cari pekerjaan yang berkaitan dengan Error stray ' 240' in program in c atau merekrut di pasar freelancing terbesar di dunia dengan 20j+ pekerjaan.

Solved: How do I fix the Error stray '\240' error in DevC++ programming? Solution #1. Selecting one of these spaces and use Find and Replace to.

You aren't referring g to my code but your error is due to The use of copy and paste code from usually a web page. You have ASCII codes copied.

You copy something into a text editor and then copy back to try. or use od c.c View source of transmission of the disease and then delete the.

Stray 204 means it found some character that it didn't know what to do with. You probably copypasted this from some website and you picked up.

What IDE version? Could you please edit your question to include the exact error message. @canadiancyborg: Your edit obscured the problem. @.

I'm looking for a bit of help here with my program. I keep getting a error saying stray 240 in program on a lot of the lines in my code. can.

stray '\302' in program. error stray ' 240' in program. It is quite frustrating to deal with all these errors. Watch the video to get rid of.

c:76: error: Each undeclared identifier is reported only once sorbolinuxexec.c:76: error: for each function it appears in. I tried compiling.

This problem comes when you have copied some text from an HTML page or you have done modification in a Windows environment and are trying to.

1. For Space Remove the spaces at the beginning and end of the error line then in the Arduino IDE select the Tools > Auto Format. Here my.

Like many text editors gedit provides syntax highlighting for many programming languages including C so different text in your program will.

Like many text editors gedit provides syntax highlighting for many programming languages including C so different text in your program will.

Stray 240 probably means byte values of decimal 240 0xF0 that somehow ended up in your program text. Moving your code to the left probably.

I keep getting a error saying stray 240 in program on a lot of the lines in my code. can anyone show me were I went wrong and how do I fix.

stray \240 in program What does this mean error: stray '\240' in program ??? Hi Post your code and we will see. If you have cut and pasted.

C :17:1: error: stray '\240' in program containerof. There was an error when the code was compiled. The reason is that the code was copied.

error: stray '\240' in program There was an error when the code was compiled. The reason is that the code was copied from the web page and.

Problem: Can't compile the code after clicking on Compile and Execute button the output in DevC++ compiler panel show error stray '240' in.

I keep getting a error saying stray 240 in program on a lot of the lines in my code. can anyone show me were I went wrong and how do I fix.

One cause of the /302 error is copy and paste code from a word processor. You have ASCII codes copied that add spaces etc to your code. Go.

One cause of the /302 error is copy and paste code from a word processor. You have ASCII codes copied that add spaces etc to your code. Go.

error: stray '\240' in program There was an error when the code was compiled. The reason is that the code was copied from the web page and.

I keep getting a error saying stray 240 in program on a lot of the lines in my code. can anyone show me were I went wrong and how do I fix.

Problem: Can't compile the code after clicking on Compile and Execute button the output in DevC++ compiler panel show error stray '240' in.

Solution: According to the error prompt line to find the illegal character delete it. If the character in the Chinese state below the red.

between Politics and Popular Culture. 206. Conclusion: Democratizing Television? The Politics of Participation. 240. Notes. 261. Glossary.

Error: stray '\240' in program is a character encoding error message. \240 is a nonbreaking space in iso88591 encoding used on web pages.

Error: Stray '\240' in program. C :17:1: error: stray '\240' in program containerof. C :17:1: error: stray '\302' in program containerof.

\302' is C notation for the octal number 3028 which equals C216 and 19410. So it's not ASCII. Which character it maps to depends on the.

Like many text editors gedit provides syntax highlighting for many programming languages including C so different text in your program.

The /240 error is due to illegal spaces before every code of line. eg. Do printfAnything;. instead of printfAnything;. This error is.

C :17:1: error: stray '\302' in program of Chinese characters in Qt and the solution to the error C2001: newline in constant problem.

error: stray '\ 302' in program / error: stray '\ 240' in program Programmer Sought the best programmer technical posts sharing site.

error: stray '\ 302' in program / error: stray '\ 240' in program Programmer Sought the best programmer technical posts sharing site.

If you're using a word processor to compose C programs But this question might end up getting closed and migrated to Stack Overflow.

C :17:1: error: stray '\302' in program containerof. The meaning of escape character is' ] 'prompted by telnet under linux / Unix.

AVR logo AVR Freaks BeaconThings BitCloud chipKIT chipKIT 3.7.2 How Do I Find the Code that Caused Compiler Errors Or Warnings in.

a and b are 2d matrices with r rows and c columns. f is a function pointer which can point to any function of the following type:

AVR logo AVR Freaks BitCloud chipKIT chipKIT logo 3.7.2 How Do I Find the Code that Caused Compiler Errors Or Warnings in My Pro.

Chapter 2: Software. We run into software at every level of Arduino development. Here is the overview.. Chapter 3: Atmel AVR.

The error message is stray '\240' in program. If we take say https://stackoverflow.com/questions/28878911/howcanigetconsole.

test.c: In function 'checkauthentication': test.c:6: error: stray '\302' in program test.c:6: error: stray '\240' in program

[C++]Linux And Ubuntu Compile below C Program error stray '\302' perhaps '\240' in program Solutions for. Reference article.

It occurs when compiling or uploading copypasted code. TryFirst of all Save the file.Then Tools>Fix Encoding & Reload.

src/Makefile/Tool.cpp:42:3: error: stray '\302' in program Stack Overflow https://stackoverflow.com/questions/7663565/.

YouTubec Compilation error: stray '\302' in program etc Stack OverflowCompile IssueLinuxC stray '\\302\\240 in program.

r/ProgrammerHumor C++ stack overflow community be like error: stray '\342' in program. error: stray '\200' in program.

quoradistilbertbase / vocab.txt. nreimers c. 6364 dollars. 6365 processing. 6366 94. 6367 remove. 6368 criticized.

stray '\302' in program. error stray ' 240' in program. It is quite frustrating to deal with all these errors.

Ok the problem is solved. Reference: http://stackoverflow.com/questions/5167656/errorstray302inprogram.

Error stray 302 in program - excellent, support

ProgrammerAH.

When programming the AVR chips you can set a bit high or low by the cable as a stray voltage on a wrong pin can ruin the Atmel chip or your computer.

Cari pekerjaan yang berkaitan dengan Error stray ' 240' in program in c atau merekrut di pasar freelancing terbesar di dunia dengan 20j+ pekerjaan.

Solved: How do I fix the Error stray '\240' error in DevC++ programming? Solution #1. Selecting one of these spaces and use Find and Replace to.

You aren't referring g to my code but your error is due to The use of copy and paste code from usually a web page. You have ASCII codes copied.

You copy something into a text editor and then copy back to try. or use od c.c View source of transmission of the disease and then delete the.

Stray 204 means it found some character that it didn't know what to do with. You probably copypasted this from some website and you picked up.

What IDE version? Could you please edit your question to include the exact error message. @canadiancyborg: Your edit obscured the problem. @.

I'm looking for a bit of help here with my program. I keep getting a error saying stray 240 in program on a lot of the lines in my code. can.

stray '\302' in program. error stray ' 240' in program. It is quite frustrating to deal with all these errors. Watch the video to get rid of.

c:76: error: Each undeclared identifier is reported only once sorbolinuxexec.c:76: error: for each function it appears in. I tried compiling.

This problem comes when you have copied some text from an HTML page or you have done modification in a Windows environment and are trying to.

1. For Space Remove the spaces at the beginning and end of the error line then in the Arduino IDE select the Tools > Auto Format. Here my.

Like many text editors gedit provides syntax highlighting for many programming languages including C so different text in your program will.

Like many text editors gedit provides syntax highlighting for many programming languages including C so different text in your program will.

Stray 240 probably means byte values of decimal 240 0xF0 that somehow ended up in your program text. Moving your code to the left probably.

I keep getting a error saying stray 240 in program on a lot of the lines in my code. can anyone show me were I went wrong and how do I fix.

stray \240 in program What does this mean error: stray '\240' in program ??? Hi Post your code and we will see. If you have cut and pasted.

C :17:1: error: stray '\240' in program containerof. There was an error when the code was compiled. The reason is that the code was copied.

error: stray '\240' in program There was an error when the code was compiled. The reason is that the code was copied from the web page and.

Problem: Can't compile the code after clicking on Compile and Execute button the output in DevC++ compiler panel show error stray '240' in.

I keep getting a error saying stray 240 in program on a lot of the lines in my code. can anyone show me were I went wrong and how do I fix.

One cause of the /302 error is copy and paste code from a word processor. You have ASCII codes copied that add spaces etc to your code. Go.

One cause of the /302 error is copy and paste code from a word processor. You have ASCII codes copied that add spaces etc to your code. Go.

error: stray '\240' in program There was an error when the code was compiled. The reason is that the code was copied from the web page and.

I keep getting a error saying stray 240 in program on a lot of the lines in my code. can anyone show me were I went wrong and how do I fix.

Problem: Can't compile the code after clicking on Compile and Execute button the output in DevC++ compiler panel show error stray '240' in.

Solution: According to the error prompt line to find the illegal character delete it. If the character in the Chinese state below the red.

between Politics and Popular Culture. 206. Conclusion: Democratizing Television? The Politics of Participation. 240. Notes. 261. Glossary.

Error: stray '\240' in program is a character encoding error message. \240 is a nonbreaking space in iso88591 encoding used on web pages.

Error: Stray '\240' in program. C :17:1: error: stray '\240' in program containerof. C :17:1: error: stray '\302' in program containerof.

\302' is C notation for the octal number 3028 which equals C216 and 19410. So it's not ASCII. Which character it maps to depends on the.

Like many text editors gedit provides syntax highlighting for many programming languages including C so different text in your program.

The /240 error is due to illegal spaces before every code of line. eg. Do printfAnything;. instead of printfAnything;. This error is.

C :17:1: error: stray '\302' in program of Chinese characters in Qt and the solution to the error C2001: newline in constant problem.

error: stray '\ 302' in program / error: stray '\ 240' in program Programmer Sought the best programmer technical posts sharing site.

error: stray '\ 302' in program / error: stray '\ 240' in program Programmer Sought the best programmer technical posts sharing site.

If you're using a word processor to compose C programs But this question might end up getting closed and migrated to Stack Overflow.

C :17:1: error: stray '\302' in program containerof. The meaning of escape character is' ] 'prompted by telnet under linux / Unix.

AVR logo AVR Freaks BeaconThings BitCloud chipKIT chipKIT 3.7.2 How Do I Find the Code that Caused Compiler Errors Or Warnings in.

a and b are 2d matrices with r rows and c columns. f is a function pointer which can point to any function of the following type:

AVR logo AVR Freaks BitCloud chipKIT chipKIT logo 3.7.2 How Do I Find the Code that Caused Compiler Errors Or Warnings in My Pro.

Chapter 2: Software. We run into software at every level of Arduino development. Here is the overview.. Chapter 3: Atmel AVR.

The error message is stray '\240' in program. If we take say https://stackoverflow.com/questions/28878911/howcanigetconsole.

test.c: In function 'checkauthentication': test.c:6: error: stray '\302' in program test.c:6: error: stray '\240' in program

[C++]Linux And Ubuntu Compile below C Program error stray '\302' perhaps '\240' in program Solutions for. Reference article.

It occurs when compiling or uploading copypasted code. TryFirst of all Save the file.Then Tools>Fix Encoding & Reload.

src/Makefile/Tool.cpp:42:3: error: stray '\302' in program Stack Overflow https://stackoverflow.com/questions/7663565/.

YouTubec Compilation error: stray '\302' in program etc Stack OverflowCompile IssueLinuxC stray '\\302\\240 in program.

r/ProgrammerHumor C++ stack overflow community be like error: stray '\342' in program. error: stray '\200' in program.

quoradistilbertbase / vocab.txt. nreimers c. 6364 dollars. 6365 processing. 6366 94. 6367 remove. 6368 criticized.

stray '\302' in program. error stray ' 240' in program. It is quite frustrating to deal with all these errors.

Ok the problem is solved. Reference: http://stackoverflow.com/questions/5167656/errorstray302inprogram.