Error for saving db5

error for saving db5

LEGO 76911 Speed Champions 007 Aston Martin DB5 James Bond Replica Toy Car Model Kit My son purchased this out of his saved up pocket money. Answers related to “error: db5 error(-30973) from dbenv->failchk: BDB0087 DB_RUNRECOVERY: Fatal error, run database recovery”. I was trying to renew my SSL certificate on my droplet by following this guide: https://certbot.eff.org/lets-encrypt/ubuntubionic-nginx But. error for saving db5 96 kB 00:00
(7/16): polkit-libs-0.116-2.fc30.x86_64.rpm error f7b5 bios 269 kB/s Error: Database is uninitialized and superuser password is not specified.
  • failed to open stream: No such file or directory in artisan on line 18
  • Permission denied @ rb_sysopen - rails
  • Error: Redis connection to 127.0.0.1:6379 failed - connect ECONNREFUSED 127.0.0.1:6379
  • error listen EADDRINUSE: address already in use :::8081.
  • verifyReleaseResources FAILED
  • OSError: [WinError 5] Access is denied:
  • error: error:0909006c:pem routines:get_name:no start line
  • 'ER_NOT_SUPPORTED_AUTH_MODE'
  • Error connecting to Redis on localhost:6379 (Errno::ECONNREFUSED) (Redis::CannotConnectError)
  • DataTables warning: table id=ExpiredRecordsTable - Requested unknown parameter '1' for row 0, column 1.
  • Unable to connect to your database server using the provided settings.
  • logger: socket /dev/log
  • fused location provider client implementation
  • (OS 10048)Only one usage of each socket address (protocol/network address/port) is normally permitted, error for saving db5. : AH00072: make_sock: could not bind to address [::]:80
  • .\Scripts\activate Execution_Policies at https:/go.microsoft.com/fwlink/?LinkID=135170.
  • Cannot start service traefik: Could not attach to network web: rpc error: code = PermissionDenied desc = network web not manually attachable
  • yo error eacces permission denied
  • containers/create: dial unix /var/run/docker.sock: connect: permission denied
  • dial unix /var/run/docker.sock: connect: permission denied
  • database not connected metasploit
  • Whoops! Error: DOMException: Failed to execute 'addIceCandidate' on 'RTCPeerConnection': Error processing ICE candidate
  • Error: Missing credentials for "PLAIN"
  • code E401 npm ERR! Unable to authenticate, need: Basic realm="https://pkgsprodcus1.pkgs.visualstudio.com/"
  • he following signatures couldn't be verified because the public key is not available: NO_PUBKEY 363A96A5CEA9EA27
  • Invalid HTTP_HOST header: '192.168.0.5:8080'. You may need to add '192.168.0.5' to ALLOWED_HOSTS.
  • curl: (3) URL using bad/illegal format or missing URL
  • valet share failed to connect to 127.0.0.1 port 4041: connection refused
  • SSL: CERTIFICATE_VERIFY_FAILED] certificate verify failed: unable to get local issuer certificate
  • [2]: the default discovery settings are unsuitable for production use; at least one of [discovery.seed_hosts, discovery.seed_providers, cluster.initial_master_nodes] must be configured
  • unable to create .git/index.lock': permission denied
  • magento 2 The requested class did not generate properly, error for saving db5, because the 'generated' directory permission is read-only
  • #1010 - Error dropping database (can't rmdir './', errno: 39 "Directory not empty")
  • elasticsearchexception[failed to bind service]; nested: accessdeniedexception
  • An error occurred (UnrecognizedClientException) when calling the GetAuthorizationToken operation: The security token included in the request is invalid.
  • Chat socket closed unexpectedly
  • okhttp cleartext error for saving db5 to not permitted by network security policy
  • fatal: Authentication failed for 'https://github.com/Othman5683/myLearningJourneyFiles.git/'
  • fatal: Authentication failed for
  • error:03000086:digital envelope routines::initialization error
  • opensslErrorStack: [ 'error:03000086:digital envelope routines::initialization error' ], library: 'digital envelope routines', reason: 'unsupported', code: 'ERR_OSSL_EVP_UNSUPPORTED' }
  • urllib.error.urlerror: <urlopen error [ssl: certificate_verify_failed] certificate verify failed (_ssl.c:852)>
  • additionally, error for saving db5, a 500 internal server error error was encountered while trying to use an errordocument to handle the request.
  • Could not create cudnn handle: CUDNN_STATUS_ALLOC_FAILED
  • 404 page not found codeigniter
  • mongod.service: Failed with result 'exit-code'.
  • remote: error: refusing to update checked out branch: refs/heads/master remote: error: By default, error for saving db5, updating the current branch in a non-bare repository
  • the ssl connection could not be established, see inner exception.
  • Job for docker.service failed because the control process exited with error code
  • cURL error 60: SSL certificate problem: unable to get local issuer certificate
  • Total 7492 (delta 4000), reused 7341 (delta 3902) error: RPC failed; curl 92 HTTP/2 stream 0 was not closed cleanly: CANCEL (err 8) fatal: the remote end hung up unexpectedly fatal: the remote end hung up unexpectedly Everything up-to-date
  • (psycopg2.OperationalError) could not connect to server: Connection refused
  • exceeded the 'max_user_connections' resource (current value: 30)
  • events.js:292 throw er; // Unhandled 'error' event ^ Error: listen EADDRINUSE: address already in use :::3000
  • A facade root has not been set.
  • get https://registry-1.docker.io/v2/: net/http: request canceled while waiting for connection (client.timeout exceeded while awaiting headers)
  • Class 'App\Http\Controllers\Response' not found
  • Could not connect to Redis at 127.0.0.1:6379: Connection refused
  • Web server failed to start. Port 8761 was already in use.
  • ublic Key Retrieval is not allowed
  • public key not retrieval
  • adb: insufficient permissions for device: missing udev rules? user is in the plugdev group
  • error 503
  • SSLSessionCache: 'shmcb' session cache not supported (known names: ). Maybe you need to load the appropriate socache module (mod_socache_shmcb?).
  • It is required that your private key files are NOT accessible by others.
  • your administrator has blocked this application
  • ] Running as root without --no-sandbox is not supported
  • Got permission denied while trying to connect to the Docker daemon socket at unix:///var/run/docker.sock: Get http://%2Fvar%2Frun%2Fdocker.sock/v1.40/containers/json: dial unix /var/run/docker.sock: connect: permission denied
  • application does not have sufficient geolocation permissions.
  • ERROR 1698 (28000): Access denied for user 'root'@'localhost'
  • address already in use :::1337
  • auth.docker.io on 192.168.65.1:53: no such host
  • nginx: [emerg] bind() to [::]:4433 failed (13: Permission denied)
  • list proceses
  • kill tcp6 0 0 :::80 :::* LISTEN 79597/apache2
  • access denied for user 'root'@'localhost'
  • SSL certificate problem: unable to get local issuer certificate
  • Error “Get https://registry-1.docker.io/v2/: net/http: request canceled” while building image
  • Unable to init server: Could not connect: Connection refused (gedit:941): Gtk-WARNING **: 13:09:24.625: cannot open display:
  • mongodb Main process exited, code=killed, error for saving db5, status=6/ABRT Failed with result 'signal'.
  • Access denied for user
  • W: Failed to fetch http://deb.parrotsec.org/parrot/dists/stable/InRelease The following signatures couldn't be verified because the public key is not available: NO_PUBKEY B56FFA946EB1660A
  • Failed binding to auth address * port 1812 bound to server default: Address already in use /etc/freeradius/3.0/sites-enabled/default[59]: Error binding to port for 0.0.0.0 port 1812 [email protected]:~$
  • Got permission denied while trying to connect to the Docker daemon socket at unix:///var/run/docker.sock: Post http://%2Fvar%2Frun%2Fdocker.sock/v1.24/auth: dial unix /var/run/docker.sock: connect: permission denied
  • 425 Failed to establish connection.\
  • xampp 500 internal canon printer error code 5100 error
  • The server requested authentication method unknown to the client [cachin g_sha2_password]
  • mysqli::real_connect(): The server requested authentication method unknown to the client [caching_sha2_password
  • System has not been booted with systemd as init system (PID 1). Can't operate. Failed to connect to bus: Host is down
  • The server encountered an internal error or misconfiguration and was unable to complete your request.
  • socket exception: failed host lookup: (OS Error: No address associated with hostname, errno = 7)
  • Address already in use - bind(2) for "127.0.0.1" port 3000 (Errno::EADDRINUSE)
  • syntax error near unexpected token `('
  • Error: listen EACCES: permission denied 0.0.0.0:3000
  • Uncaught Error in onSnapshot: FirebaseError: Missing or insufficient permissions.
  • Connection could not be established with host smtp.mailtrap.io :stream_socket_client(): Unable to connect to tcp://smtp.mailtrap.io:2525 (Connection refused)
  • `require': cannot load such file -- httparty (LoadError)
  • failed to push some refs to 'https://github.com/felooh/voting-sys.git
  • error: couldn't set 'refs/remotes/origin/master'
  • TypeError: transporter.sendMail is not a function
  • WebDriverError: Process unexpectedly closed with status 1
  • It is required that your private key files are NOT accessible by others. This private key will be ignored.
  • (node:621) UnhandledPromiseRejectionWarning: Error: Failed to launch chrome!
  • pyppeteer.errors.BrowserError: Browser closed unexpectedly
  • NET::ERR_CERT_COMMON_NAME_INVALID
  • ERROR for site owner: Invalid key type
  • ArgumentError (Before process_action callback :authenticate_api_request has not been defined) rails error
  • host key verification failed
  • The body might complete normally, causing 'null' to be returned, but the return type is a potentially non-nullable type.
  • the body might complete normally causing 'null' to be returned
  • Error: listen EADDRINUSE: address already in use :::1337 at Server.setupListenHandle windows
  • listen EADDRINUSE: address already in use
  • amazonaws.com: Permission denied (publickey,gssapi-keyex,gssapi-with-mic).
  • Failed to connect: org.bluez.Error.NotReady
  • Unable to init server: Could not connect: Connection refused (eog:22): Gtk-WARNING **: 21:54:46.367: cannot open display:
  • AH00558: apache2: Could not reliably determine the server's fully qualified domain name, error for saving db5, using 127.0.0.1. Set the 'ServerName' directive globally to suppress this message
  • cannot enqueue error for saving db5 after already enqueuing a handshake
  • Error: Failed to launch the browser process puppeteer
  • google authorization error 403 disallowed_useragent cordova
  • The metadata storage is not up to date, please run the sync-metadata-storage comman d to fix this issue.
  • 502 bad gateway nginx mamp
  • cloudinary error relation active storage blobs does not exist
  • ssh-copy-id error no identities found
  • No application encryption key has been error for saving db5 URI does not have hostname, domain name and tld
  • - RemoveCaches (13: Permission denied)
  • chdir(): No such file or directory (errno 2)
  • Uncaught Error: listen EADDRINUSE: address already in use 0.0.0.0:3000
  • pgadmin4 404 not found
  • autoreconf: automake failed with exit status: 1 gpaste error
  • The virtual machine 'Linux' has terminated unexpectedly during startup with exit code 1 (0x1).
  • fatal: refusing to merge unrelated histories
  • WARNING: This is a development server. Do not use it in a production deployment.
  • ERROR 1524 (HY000): Plugin 'unix_socket' is not loaded
  • ParserError: unexpected end error for saving db5 data
  • There was an error trying to log you out: ''
  • could not initialize proxy - no session spring boot
  • platforms\android\app\src\main\res\xml\network_security_config.xml:7: AAPT
  • scaffold-dbcontext login failed for user
  • Error: listen EADDRINUSE: address already in use :::5000
  • Module not found: Error: Can't resolve 'crypto' in '/workspace/signally/frontend/node_modules/uid2'
  • * branch main -> FETCH_HEAD fatal: refusing to merge unrelated histories
  • Http failure during parsing for
  • websockets wont connect
  • socket.io wont connect
  • err_connection_refused socket io
  • errno: 1251
  • angular 404 not found on server
  • firestore-permission-denied-missing-or-insufficient-permissions
  • homebrew mysql service not starting
  • 404 Not Found [IP: 91.189.88.142 80]
  • smtp error: could not authenticate, error for saving db5. hostinger
  • atomic notify_one is unavailable
  • Unable to get permission to notify. FirebaseError: Messaging: We are unable to register the default service worker. Failed to register a ServiceWorker for scope
  • Unhandled Exception: PlatformException(no_available_camera, error for saving db5, No cameras available for taking pictures., null, null)
  • error command failed with exit code 1. yarn
  • Permissions sur le fichier de configuration incorrectes, il ne doit pas être en écriture pour tout le monde !
  • ah00111: config variable ${apache_run_dir} is not defined
  • Fatal error: Allowed memory size of 1610612736 bytes exhausted (tried to allocate 32 bytes) in
  • Native client is not specified for connection -Dbeaver
  • org.apache.http.ProtocolVersion
  • D/NetworkSecurityConfig: No Network Security Config specified, error for saving db5, using platform default
  • ssh: connect to host 192.168.178.45 port 22: Connection refused lost connection
  • error connection refused ports
  • Status 204
  • Host key verification failed.
  • EADDRINUSE, error for saving db5, Address already in use - Kill server
  • Access denied; you need (at least one of) the SUPER, error for saving db5, SYSTEM_VARIABLES_ADMIN error for saving db5 SESSION_VARIABLES_ADMIN privilege(s) for this operation
  • sh: 1: cross-env: not found
  • DioError [DioErrorType.DEFAULT]: HandshakeException: Handshake error in client (OS Error: I/flutter (28831): CERTIFICATE_VERIFY_FAILED: self signed certificate(handshake.cc:354))\
  • how to solve flutter CERTIFICATE_VERIFY_FAILED error while performing a POST request?
  • JDWP Transport dt_socket failed to initialize, TRANSPORT_INIT(510)
  • The metadata storage is not up to date, please run the sync-metadata-storage command to fix this issue.
  • browser-sync command not found
  • x error of failed request: badlength (poly request too large or internal xlib length error)
  • shell_exec() has been disabled for security reasons
  • Failed to load resource: net::ERR_FILE_NOT_FOUND
  • wordpress elementor error 500
  • permission denied port 3000
  • SSL error: [SSL: TLSV1_ALERT_PROTOCOL_VERSION] tlsv1 alert protocol version (_ssl.c:590)
  • this app has been blocked by your system administrator
  • Error R10 (Boot timeout) -> Web process failed to bind to $PORT within 60 seconds of launch
  • Database C:/Users/Rajesh/test not found, error for saving db5, either pre-create it or allow remote database creation (not recommended in secure environments) [90149-200] 90149/90149 (Help)
  • Permissions 0644 for 'id_rsa.pub' are too open.
  • the network adapter could not establish the connection
  • received empty response from zabbix agent at [192.168.0.3]. assuming that agent dropped connection because of access permissions.
  • status:display_server_not_supported
  • firestore missing or insufficient permissions
  • internal server error heroku
  • php_network_getaddresses: getaddrinfo failed: Temporary failure in name resolution
  • Test running failed: Instrumentation run failed due to 'Process crashed.'
  • com.mongodb.mongosocketopenexception: exception opening socket
  • no pg_hba.conf entry for host SSL off
  • could not be opened in append mode failed to open stream permission denied
  • SERVER_ERROR: [code] 1675030 [message]: Error performing query. [extra]:
  • UNHANDLED REJECTION error:0308010C:digital envelope routines::unsupported
  • WARNING: This is a development server. Do not use it in a production deployment. Use a production WSGI server instead.
  • unhandled exception: handshakeexception: handshake error in client (os error:
  • drupalvm GuzzleHttp\Exception\ConnectException: cURL error 7: Failed to connect to localhost port 8000: Connection refused
  • how to get client assertion ok okta
  • server error
  • fatal: unable to auto-detect email address
  • An unhandled exception occurred: Port 4200 is already in use. Use '--port' to specify a different port.
  • Error: Encountered bad status code (400) for https://d2ql0qc7j8u4b2.cloudfront.net/integration-cordova.tar.gz
  • permission denied for editing seuder file
  • vagrant The revocation function was unable to check revocation for the certificate.
  • WSL2 request to https://registry.npmjs.org/yarn failed, reason: getaddrinfo EAI_AGAIN registry.npmjs.org
  • openssl error: error:140e0197:ssl routines:ssl_shutdown:shutdown while in init
  • Error CS1069 The type name 'SqlConnection' could not be found in the namespace 'System.Data.SqlClient'. This type has been forwarded to assembly 'System.Data.SqlClient, Version=0.0.0.0, Culture=neutral,
  • code=H18 desc="Server Request Interrupted"
  • fatal: could not lookup name for submodule 'docroot/web/sites/all/vendor/guzzlehttp/ringphp'
  • Oauth2 Full authentication is required to access this resource
  • discord.ext.commands.errors.CommandNotFound:
  • curl: (6) Could not resolve host: http-inputs-hec.splunkcloud.com
  • botocore.exceptions.ClientError: An error occurred (AccessDenied) when calling the PutObject
  • responseentity error message
  • Error in checking parameter list: AH00526: Syntax error on line 9 of /etc/apache2/ports.conf: Cannot define multiple Listeners on the same IP:port
  • Apache is unable to check whether or not the module is loaded because Apache is fumefx application error to fix 'Mixed Content: The page was loaded over HTTPS, error for saving db5, but requested an insecure script” [duplicate]
  • mosquitto Error for saving db5 <unknown> disconnected, not authorised
  • clear-sign failed: No secret key
  • debian fatal error: json.h: Aucun fichier ou dossier de ce type
  • Someone could be eavesdropping on you right now (man-in-the-middle attack)! It is also possible that a host key has just been changed.
  • Class 'App\Http\Requests\Rule' not found
  • PostTooLargeException
  • clojure http/server-error?
  • ActiveRecord::ConnectionNotEstablished: FATAL: role "Myname" does not exist
  • Property 'ethers' does not exist on type 'HardhatRuntimeEnvironment'.ts(2339)
  • connection error mysql in node js
  • (Caused by SSLError(SSLEOFError(8, 'EOF occurred in violation of protocol (_ssl.c:1129)'))) - skipping
  • ERROR: for mongo Cannot start service mongo: driver failed programming external connectivity on endpoint xhgui mongo_1
  • SQLSTATE[42000]: Syntax error or access violation: 1071 Specified key was too long; max key length is 1000 bytes (SQL: a lter table `users` add unique `users_email_unique`(`email`))
  • subprocess.CalledProcessError: Command '['netsh', error for saving db5, 'wlan', 'show', error for saving db5, 'profiles']' returned non-zero exit status 1.
  • The Dev Hub org cannot be deleted.
  • Message The requested resource [/manager/html] is not available
  • convert-im6.q16: attempt to perform an operation not allowed by the security policy `PDF' @ error/constitute.c/IsCoderAuthorized/408.
  • selenium error 403
  • documate drivers 4790
  • Database access not available, error for saving db5. Please use to establish connection. There's a graph waiting for you. neo4j
  • documate 4790 f63 error
  • failed (Result: exit-code) since Wed 2022-05-25 21:08:49 EAT; 753m> Docs: https://docs.mongodb.org/manual
  • connect ECONNREFUSED 127.0.0.1:3306 docker
  • ERR_HTTP2_PROTOCOL_ERROR wordpress
  • nginx https err_connection_closed
  • curlftps Error connecting to ftp: Access denied: 530
  • Error error for saving db5 broker listeners from 'localhost': Unable to parse localhost to a broker endpoint
  • permission denied: bin/cake bake
  • Database [postgres] not configured
  • platformIO Permission denied: '/dev/ttyUSB0'
  • cpanel permission fix
  • htcondor daemons not running
  • required for server start
  • xampp the application was unable to start correctly
  • MPI_STATUS_IGNORE
  • raise RuntimeError(_request_ctx_err_msg) RuntimeError: Working outside of request context
  • cors not working
  • Error: Network Error at createError (createError.js:16) at XMLHttpRequest.handleError (xhr.js:117)
  • HTTP Strict Transport Security (HSTS) Errors and Warnings
  • If nothing else helps, add SKIP_PREFLIGHT_CHECK=true to an .env file in your project. That would permanently disable this preflight check in case you want to proceed anyway.
  • com.amazonaws.SdkClientException: Failed to connect to service endpoint:
  • npm permission denied sudo
  • mail: cannot send message: process exited with a non-zero status
  • RabbitMQ error handling
    • permission denied for window type 2002
    • error launcher chromeheadless failed 2 times (cannot start). giving up
    • Failed to load resource: the server responded with a status of 500 (Internal Server Error)
    • Cannot render console from 172.19.0.1! Allowed networks: 127.0.0.0/127.255.255.255
    • ActiveRecord::StatementInvalid (SQLite3::BusyException: database is locked)
    • no valid crumb was included in the request
    • makemigrations permission denied
    • Livewire encountered corrupt data when trying to hydrate the [cart.view] component, error for saving db5. Ensure that the [name, id, error for saving db5, data] of the Livewire component wasn't tampered with between requests.
    • pg_ctl: could not start server examine the log output.
    • PG::ConnectionBad (SCRAM authentication requires libpq version 10 or above web_1 28 kB 00:00
      (14/16): vim-minimal-8.1.1991-2.fc30.x86_64.rpm 393 kB/s

      RPM DB_VERSION_MISMATCH #47

      Describe the bug

      Run Yum update, or try to install a package using yum:

      RPM: error: db5 error(-30969) from dbenv->open: BDB0091 DB_VERSION_MISMATCH: Error for saving db5 environment version mismatch
      RPM: error: cannot open Packages index using db5 - (-30969)
      RPM: error: cannot open Packages database in /var/lib/rpm
      The downloaded packages were saved in cache until the next successful transaction.
      You can remove cached packages by executing 'dnf clean packages'.
      Error: Could not run transaction.

      To Reproduce
      Steps to reproduce the behavior:

      1. Reboot
      2. yum update
      3. See error

      Expected behavior
      Updates completed succesfully

      Additional context
      I have deleted and started from scratch the whole WSL environment and yum works for one update cycle, error for saving db5, then after an update and reboot I get the same error above.

      Basic Troubleshooting Checklist

      [x] I have searched Google for the error message.
      [x] I have checked official WSL troubleshooting documentation: https://docs.microsoft.com/en-us/windows/wsl/troubleshooting#confirm-wsl-is-enabled.
      [x] I have searched the official Microsoft WSL issues page: https://github.com/Microsoft/WSL/issues.
      [x] I have searched the WLinux issues page: https://github.com/WhitewaterFoundry/WLinux/issues.
      [x] I have reset WLinux: Settings->Apps->Apps & features->WLinux->Advanced Options->Reset.
      [x] I have disabled and re-enabled WSL in Windows Features.
      [x] I have run Windows 10 updates and restarted.

      Windows Build

      OS Version: 10.0.18362 N/A Build 18362

      copy paste:

      Upgrading:
      dnf noarch 4.2.8-2.fc30 updates 405 k
      dnf-data noarch 4.2.8-2.fc30 updates 45 k
      dnf-yum error + no running copy + squid php parse error syntax error, unexpected noarch 4.2.8-2.fc30 updates 42 k
      fontconfig error for saving db5 x86_64 2.13.1-9.fc30 updates 253 k
      jbig2dec-libs x86_64 0.16-1.fc30 updates 69 k
      libdnf x86_64 rad studio xe windows 7 help error 0.35.2-3.fc30 updates 589 k
      libxcrypt x86_64 4.4.9-1.fc30 error for saving db5 updates 123 k
      libxcrypt-compat x86_64 4.4.9-1.fc30 updates 96 k
      polkit-libs x86_64 honorbuddy 5.1 error 0.116-2.fc30 updates 64 k
      python3-dnf noarch 4.2.8-2.fc30 error for saving db5 updates 413 k
      python3-hawkey x86_64 0.35.2-3.fc30 updates 93 k
      python3-libdnf x86_64 0.35.2-3.fc30 updates error for saving db5 708 k
      vim-common x86_64 error for saving db5 2:8.1.1991-2.fc30 hp laptop error code 0303 updates printer canon mp145 error e8 6.7 M
      vim-enhanced x86_64 error for saving db5 2:8.1.1991-2.fc30 updates error for saving db5 1.4 M
      vim-filesystem noarch 2:8.1.1991-2.fc30 updates 28 k
      vim-minimal x86_64 2:8.1.1991-2.fc30 updates error for saving db5 619 k

      Upgrade 16 Packages

      Total download size: 12 M
      Is this ok [y/N]: y
      Downloading Packages:
      (1/16): dnf-yum-4.2.8-2.fc30.noarch.rpm error for saving db5 86 kB/s 1.4 MB 00:04
      (16/16): vim-common-8.1.1991-2.fc30.x86_64.rpm ora-04063 package body has errors 612 kB/s

      0 Comments

      Leave a Comment