Error 1335 the cabinet file data1.cab

error 1335 the cabinet file data1.cab

While installing Captools/net Server Suite, Error 1335 occurs. This means the cabinet file 'data1.cab' required for this installation is corrupt and. dll file, but the file isn't sure what to do because it can't find the line of code within himself to answer. This can happen for several reasons, that fall. I keep getting this error when trying to install the software! "Error 1335": The cabinet file 'Bas.cab' required for this instillation is corrupt and cannot.

Error 1335 the cabinet file data1.cab - apologise

MSI error occurs. Error 1335 the cabinet file DATA1. CAB. is corrupted.

  • Error 1335 the Cabinet file

    Hello

    When I install Microsoft Flight Simulator X, I get the error message 1603. But before I got this messase that I get an Error 1335 the Cabinet File "D1 ~ 10.CAB '.

    I copied all files from drive 1 and 2 on my hard drive and I still get the same message.

    Help, please

    Hello

    Cabinet (or CAB) is a file format to archive for Microsoft Windows that supports compression without loss of data and embedded digital certificates used to maintain the integrity of the archive. CAB files have file name extensions.

    Install the game in the clean boot and check if it helps.

    To help resolve the error and other messages, you can start Windows XP by using a minimal set of drivers and startup programs. This type of boot is known as a "clean boot". A clean boot helps eliminate software conflicts.

    How to configure Windows XP to start in a "clean boot" State

    Note: follow step 4 to reset the computer to start as usual after the boot process.

    Hope this information helps.

  • An error has occurred. Check the log file. C:\User\---\PamperedPartnerPlus\workspace\.metadata\.log

    What should I do: an error has occurred. Check the log file. C:\User\---\PamperedPartnerPlus\workspace\.metadata\.log.

    See this post and follow the instructions to update your program to possibly solve the problem.

    Technical support
    http://www.chefsuccess.com/F46/tech-support-41431/

  • Error 1335 the data4.cab file is corrupt and cannot be used, what I have to do

    Error 1335 the data4.cab file is corrupt and cannot be used, what I have to do

    Hi Max210662,

    Please follow the mentioned kb: http://helpx.adobe.com/creative-suite/kb/install-error-1311-1335-or.html .

    Kind regards

    Romit Sinha

  • FlexBuilder startup error - an error has occurred. Check the log file.

    Hello everyone. It baffles me. When I try to load FlexBuilder, I get a message popup stating the following:

    "An error has occurred. Check the log file
    c:\Program Files\Adobe\Flex Builder 2\configuration\1201413244722.log"

    Note that the file name of the change log. Also note that this file does not exist. I can't find anywhere on my computer. Also note that I am running Vista in 32-bit mode. The error of course is not very descriptive, especially since I don't have the log file. I think that this may be due to a corrupt workspace, but I'm not sure. I've uninstalled and reinstalled the software several times and it will work for awhile, but then he'll come back.

    Any ideas?

    In addition, anyone know of a configuration file that I can change the workspace without loading FlexBuilder? If it is a corrupt workspace I would try to get around it by tapping a different workspace FlexBuilder (I have several).

    Thank you
    Amanda

    Yes, my solution was the same thing. I just run as administrator. After some research it turns out that this is how Microsoft treats problems of incompatibility in Vista. Microsoft actually recommends this:

    1. right click on the executable
    2. Select the "Compatibility" tab
    3. check "run this program as an administrator".

    That's nice, so at least you don't have to manually run the program as administrator, every time that you run the program. Although I find it funny that this is microsofts workaround!

  • Cannot access my Windows Live Mail. Gives me the message "one of the installation files seems to be corrupted. Error: 0 x 80070002.

    Cannot access my Windows Live Mail. Gives me the message "one of the installation files seems to be corrupted. Error: 0 x 80070002. Source: WaitForCatalogue.

    original title: error 8 x 0070002

    Windows Live Mail Forum
    http://windowslivehelp.com/forums.aspx?ProductID=15

  • Windows xp hp will not start. error message: Windows has not start because the following file is missing or corrupt: < root windows > \system32\hal.dll. Please re - install a copy of the above file.

    Hello, I recently restored my windows hp tower to its factory because of virus settings and when I restarted my PC I recieced this error message: Windows has not start because the following file is missing or corrupt: \system32\hal.dll

  • Download error. The downloaded file has no verification. Code of error = 0x80040507__Google Chrome Installer

    Hello. I have a problem that I recently received these messages on computer blue screen comes and goes... (bsofd) when im using the internet only. Told me to stop using ie 8 and google chrome but when I tried to download it it was the message that I received... "Download error. The downloaded file has no verification. error code = 0 x 80040507 ". I have windows xp... SP3. my hardware is dual cpu, 2 GB ram, 1 TB hard drive and 512 graphics card. Please help me

    Hi Arvind,

    You try to run chkdsk on the machine and check if the problem persists.

    How to perform disk error checking in Windows XP

    Hope the helps of information. Please post back and we do know.

    Concerning
    Joel S
    Microsoft Answers Support Engineer
    Visit our Microsoft answers feedback Forum and let us know what you think.

  • The best way to perform checks to find errors in the system files on a regular basis?

    What looks like the best of fashion to plan the audit of the system partition
    the presence of errors in the system files and bad sectors on the system partition?

    Tasks scheduled by Vista?
    Vista help recovering all documentation of chkdsk,
    so I'm afraid it is supported under Vista?

    Hello

    read the information below about

    http://www.Vistax64.com/tutorials/67612-check-disk-Chkdsk.html

    and also that

    Run the sfc/scannow command.

    http://support.Microsoft.com/kb/929833

    Use the (SFC.exe) System File Checker tool to determine which file is causing the problem and then replace the file. To do this, follow these steps:

    1. Open an elevated command prompt. To do this, click Start, click principally madeprograms,Accessories, right-clickguest, and then clickrun as administrator. If you are prompted for an administrator password or a confirmation, type the password, or clickallow.
    2. Type the following command and press ENTER:

      sfc/scannow

      The sfc/scannow command analyzes all protected system files and replaces incorrect versions with appropriate Microsoft versions

  • All Applications have 0xc0000006 error, I can't update or run anything else and the system restore is unable to work because of error 0 x 80070570 (file or directory is corrupted and unreadable).

    I have a very new computer with Windows 7 Professional, and two weeks ago, he had a critical update.  Since then, McAfee has had problems.  I corrected McAfee, but yesterday, when I turned on the computer, I received a message that my windows is not genuine.  I accidentally clicked Ignore (or activate later) button instead of the activation button.  Now none of the software or applications to work and I can't get the computer to any previous dates because of the message: file or directory is corrupted and unreadable 0 x 80070570.

    I checked today and my Windows 7 is genuine.

    Many updates Microsoft Office cannot run also, since that time.

    How I fixed the 0 x error 80070570 and requests 0xc0000006 error?

    How I fixed the 0 x error 80070570 and requests 0xc0000006 error?

    Buy a new HARD drive . Your HARD drive is dying:

    //
    MessageId: STATUS_IN_PAGE_ERROR
    //
    MessageText:
    //
    The instruction at 0 x %p memory referenced to 0 x % the required data has not been placed in memory due to a State of error / 0 x %x.
    //
    #define STATUS_IN_PAGE_ERROR ((NTSTATUS)0xC0000006 L)

    Windows cannot read data from the HARD drive, that's why you got the errors.

    André

    "A programmer is just a tool that converts the caffeine in code" Deputy CLIP - http://www.winvistaside.de/

  • Download this message when I try to run Lightroom. Point procedure entry AgTransitCargo_pushTransitCargo could not be found in the AgKernel.dll dynamic link library - system: windows 7 64 bit is no error in the log file

    Download this message when I try to run Lightroom. The procedure entry point AgTransitCargo_pushTransitCargo could not be found in the AgKernel.dll dynamic link library

    system: windows 7 64-bit

    There is no error in the log file.

    no error in scannow at the command prompt.

    errore lightroom.jpg

    Hi Michela,

    Lightroom makes a call the the AGkernel.dll file, but the file isn't sure what to do because it can't find the line of code within himself to answer. This can happen for several reasons, that fall within these two broad categories: AGkernel.dll is damaged and must be repaired or AGKernel.dll version is incorrect and should be updated to the correct version.

    Here are some things you can do to fix the file:

    -Record again with Windows AGKernel.dll: https://support.microsoft.com/en-us/kb/249873

    -Windows repair: https://support.microsoft.com/en-us/kb/929833

    -Install all the updates that are available for Windows: Windows Installer updates

    -Uninstall and reinstall Lightroom

    Kind regards

    Tanuj

  • Packer of creative cloud in creating a package that I can install do not.  He goes through the motions, download all updates, create setup file, but it does not work despite the fact that there are no errors in the log files

    Packer of creative cloud in creating a package that I can install do not.  He goes through the motions, download all updates, create setup file, but it does not work despite the fact that there are no errors in the log files

    After hitting my head against the desk to repeatedly create packages, try on different computers I have finally found a solution.

    These packages have been copied on an external drive, if I try and install from the external drive, which is a common practice, it fails.

    If I then copy this file pkg from the outside, to the computer I install, then run it, it will to and moved very well.

    That is mind-boggling stupid, because it's rare that you have to copy the file into any computer, it is less always installed off the coast of externally, and many people in the company are pushing on the network and the management of the suites so there is a serious problem in Adobe package manager if this is the case where it cannot manage the Middle installed offshore.

    I hope that if anyone else is having problems so it suits.

  • Error reading the configuration file

    I install the Adobe Access 4.0 trial license server and when I run the g - r on the Tomcat installation dir \licenseserver Validator.bat I get a message "error reading configuration file. Here's the log dump:

    [] 2012-12-20 22:46:32, 176 INFO [[Partition (flashaccessserver)].com.adobe.flashaccess.server.license.context.SimpleContex tFactory] class loader of partition creation «flashaccessserver"with «[file:/c:/Tomcat6/licenseserver/flashaccessserver/libs/, file:/c:/Tomcat6/licenseserver/flashaccessserver/libs/flashaccess-license-server-ext-samp le.jar]» libraries

    [2012-12-20 22:46:32, ERROR 582 [. com.adobe.flashaccess.server.license.tools.Validator [Partition (flashaccessserver)]] could not validate the deployment tenant "flashaccessserver/sampletenant".

    com.adobe.flashaccess.server.common.configuration.ConfigurationException: error reading the configuration file

    at com.adobe.flashaccess.server.license.configuration.commonsadapter.Constants.parseTenantCo nfigurationStream(Constants.java:139)

    to com.adobe.flashaccess.server.license.configuration.commonsadapter.TenantConfigurationImpl. < init > (TenantConfigurationImpl.java:110)

    at com.adobe.flashaccess.server.license.configuration.commonsadapter.CommonsConfigurationBas edFactory.getTenantConfiguration(CommonsConfigurationBasedFactory.java:90)

    at com.adobe.flashaccess.server.license.tools.Validator.validateTenantDeployment (Validator.j ava: 255)

    to com.adobe.flashaccess.server.license.tools.Validator.validatePartitionDeployment (Validato r.java:283)

    at com.adobe.flashaccess.server.license.tools.Validator.validateGlobalDeployment (Validator.j ava: 301)

    at com.adobe.flashaccess.server.license.tools.Validator.process(Validator.java:173)

    at com.adobe.flashaccess.server.license.tools.Validator.main(Validator.java:117)

    Caused by: org.apache.commons.configuration.ConfigurationException: could not load the configuration

    at org.apache.commons.configuration.XMLConfiguration.load(XMLConfiguration.java:863)

    at org.apache.commons.configuration.XMLConfiguration.load(XMLConfiguration.java:821)

    at com.adobe.flashaccess.server.license.configuration.commonsadapter.Constants.parseTenantCo nfigurationStream(Constants.java:134)

    ... 7 more

    Caused by: org.xml.sax.SAXParseException; lineNumber: 121; columnNumber: 16; HVAC-complex - type. 2.4.b: the content of the element "KeyServer" is not over. A the "{"http://licenseserver.flashaccess.adobe.com/tenant": file"}' should. "

    at com.sun.org.apache.xerces.internal.util.ErrorHandlerWrapper.createSAXParseException (exercise wn Source)

    at com.sun.org.apache.xerces.internal.util.ErrorHandlerWrapper.error (unknown Source)

    at com.sun.org.apache.xerces.internal.impl.XMLErrorReporter.reportError (unknown Source)

    at com.sun.org.apache.xerces.internal.impl.XMLErrorReporter.reportError (unknown Source)

    at com.sun.org.apache.xerces.internal.impl.XMLErrorReporter.reportError (unknown Source)

    at com.sun.org.apache.xerces.internal.impl.xs.XMLSchemaValidator$ XSIErrorReporter.reportErro (Unknown Source)

    at com.sun.org.apache.xerces.internal.impl.xs.XMLSchemaValidator.reportSchemaError (unknown Source)

    at com.sun.org.apache.xerces.internal.impl.xs.XMLSchemaValidator.elementLocallyValidComplexT (unknown Source) type

    at com.sun.org.apache.xerces.internal.impl.xs.XMLSchemaValidator.elementLocallyValidType (KNU nown Source)

    at com.sun.org.apache.xerces.internal.impl.xs.XMLSchemaValidator.processElementContent (exercise wn Source)

    at com.sun.org.apache.xerces.internal.impl.xs.XMLSchemaValidator.handleEndElement (unknown Source)

    at com.sun.org.apache.xerces.internal.impl.xs.XMLSchemaValidator.endElement (unknown Source)

    at com.sun.org.apache.xerces.internal.impl.XMLDocumentFragmentScannerImpl.scanEndElement (KNU nown Source)

    to com.sun.org.apache.xerces.internal.impl.XMLDocumentFragmentScannerImpl$ FragmentContentDri ver.next (unknown Source)

    at com.sun.org.apache.xerces.internal.impl.XMLDocumentScannerImpl.next (unknown Source)

    at com.sun.org.apache.xerces.internal.impl.XMLNSDocumentScannerImpl.next (unknown Source)

    at com.sun.org.apache.xerces.internal.impl.XMLDocumentFragmentScannerImpl.scanDocument (exercise wn Source)

    at com.sun.org.apache.xerces.internal.parsers.XML11Configuration.parse (unknown Source)

    at com.sun.org.apache.xerces.internal.parsers.XML11Configuration.parse (unknown Source)

    at com.sun.org.apache.xerces.internal.parsers.XMLParser.parse (unknown Source)

    at com.sun.org.apache.xerces.internal.parsers.DOMParser.parse (unknown Source)

    at com.sun.org.apache.xerces.internal.jaxp.DocumentBuilderImpl.parse (unknown Source)

    at org.apache.commons.configuration.XMLConfiguration.load(XMLConfiguration.java:855)

    ... 9 more

    I use a relative path to my .pfx file to the transportServerCredential and the licenseServerCredential in the flashaccess - tenant.xml and my password was encoded using the Scrambler.bat.

    Also, when I check using the configuration http://< LicenseServer >: 8080/flashaccessserver/flashaccess/license/v2I get the message "license server is configured properly."

    Any ideas why the Validator.bat cannot read the configuration file?

    Neil and may,

    I also used the evaluation of access version 4.0, and I got stuck in the same place you did.  I had two main symptoms.

    (1) the validator was not with the same error that you are experiencing.

    (2) later, while trying to acquire a license for playing packaged content, encrypted, the license acquisition failed, and the cause of the original error has also pointed out the Key Server parameter in flashaccess - tenant.xml.

    According to the documentation, the certificate server key (and in fact the key server itself) are supposed to will be necessary only when a policy calls for remote key service to clients of iOS.  But, I took a chance and added the .pem file in the sampletenants directory and made him the flashaccess - tenant.xml as follows:

    Configuration Tenant /Users/Ravenwind/Documents/Main.swf contains invalid data.

    in Vehicle / frame1)

    I'm stumped

    ' I don't then assign vehicle to document class box in the property ' Do not assign the vehicle that the document class... out of the way.

    In the main file, if you don't already create one, create a movieclip symbol (just draw a shape in there at the moment).  Right click on the symbol in the library and select the link.   In the interface that appears, select the export for Actionscript option and give it the class name "Vehicle" in the field labeled 'Class'

    Make sure that you save the file Vehicle.as once you put the code in it and have this file in the same folder as your Main.fla file.

    If you do the things that I just you describe should see an instance of movieclip, which cross the scene when you run the file.

  • AIP-50055: error in the configuration file

    Hi all

    I defined a 850 doc in EDI X 12 on the Internet and I have defined an internal delivery channel to choose the file to a folder. After the deployment of the Setup, I get the error below and the file does not get picked up from this location.

    2009.02.05 to 05:36:46:017: B2BStarter wire: B2B - Error (ERROR) -: AIP-50055: error in the configuration file
    at oracle.tip.adapter.b2b.init.Repository.b2bEngineConfiguration(Repository.java:770)
    at oracle.tip.adapter.b2b.init.Repository.initialize(Repository.java:711)
    at oracle.tip.adapter.b2b.init.B2BServer.readRepository(B2BServer.java:451)
    at oracle.tip.adapter.b2b.init.B2BServer.initialize(B2BServer.java:183)
    at oracle.tip.adapter.b2b.init.B2BStarter.startB2B(B2BStarter.java:298)
    at oracle.tip.adapter.b2b.init.B2BStarter.run(B2BStarter.java:144)
    at java.lang.Thread.run(Thread.java:534)

    I even tried to make the configuration and restart the server. But still, it did not help.

    Please help me solve this problem.

    Kind regards
    Khli

    Hi khli,.

    It seems that the WalletLocation property is not available in tip.properties. Please provide it as necessary when the server starts

    Kind regards
    Dheeraj

  • Certificates

    Error 1335. The cabinet file 'Data1.cab' required for this installation... (4223069)

    Product(s):
    LiteSpeed for SQL Server
    5.2, 5.1.1, 5.1, 5.0.2.1030, 5.0.2.1029, 5.0.1.1060, 5.0.0.10668, 4.8.4.00086, 4.8.3.00025, 4.8.1.00009, 4.8.0.00077, 4.8.2, 4.8.1, 4.7.0.00096, 4.5.0.0010, 4.6.0.00293, 4.6.0.00279, 4.5.0.00204, 4.5.0.0018, 4.5.0.00199, 4.5.0.00182, 4.5.0.00157, 4.5.0.00139, 4.5.0.00108, 4.5.0.00103, 4.5, 4.0.99, 4.0.95, 4.0.98, 4.0.85, 4.0, 3.2, 3.1, 3.0
    Topic(s):
    Technical Solutions
    Article History:
    Created on: 8/22/2022
    Last Update on: 8/24/2022

    Your Request will be reviewed by our technical reviewer team and, if approved, will be added as a Topic in our Knowledgebase.

    You can find online support help for Quest *product* on an affiliate support site. Click continue to be directed to the correct support content and assistance for *product*.

    © 2022 Quest Software Inc. ALL RIGHTS RESERVED. Feedback Terms of Use Privacy

    The Quest Software Portal no longer supports IE8, 9, & 10 and it is recommended to upgrade your browser to the latest version of Internet Explorer or Chrome.

    Upgrade to IE 11 Click here

    Upgrade to Chrome Click here

    If you continue in IE8, 9, or 10 you will not be able to take full advantage of all our great self service features.

    Data1.cab: How to Fix, Download, and Update

    data1.cab 64-bit (x64) Expand for Detailed File Information +
    OS Version:Windows 10
    File Size:21269085
    File Date:11/12/2019
    MD5 Checksum:d7ad3167240ced56a489ee51cb1cf347
    SHA1 Checksum:5764eb0541ed619afde3d97675ce7bd4f61c73d1
    SHA256 Checksum:34c11f0529239a91dbb7bc5ecf4bf3cdfa53aff7cfce9e845d168452ebbbd6b6
    CRC32:def893e6
    File Directory Location: C:\Users\Tester\AppData\Local\Temp\NeroInstallF...
    File Version, System, and Machine Information
    File Modification Date/Time:11/12/2019
    data1.cab 64-bit (x64) Expand for Detailed File Information +
    OS Version:Windows 10
    File Size:26510115
    File Date:11/12/2019
    MD5 Checksum:4c9546367bb8eaa6cbabdb573f5d27d4
    SHA1 Checksum:29ce9c5fb760d83c2328227940defc537e5b168a
    SHA256 Checksum:9e6184c5f8a349bf8993ca238c6667824ab157a43869fa9555e1656cb4bb22a4
    CRC32:0de072f2
    File Directory Location: C:\Users\Tester\AppData\Local\Temp\NeroInstallF...
    File Version, System, and Machine Information
    File Modification Date/Time:11/12/2019
    data1.cab 64-bit (x64) Expand for Detailed File Information +
    OS Version:Windows 10
    File Size:1474200
    File Date:11/12/2019
    MD5 Checksum:40559fb898447d4e30a95c14d399e769
    SHA1 Checksum:9a9ef72331788bf6b9864d5ca5d6f624ed8e1e21
    SHA256 Checksum:6c8daa8ce50153460393a84167c8774048540bf111f77e861dd0a066842c0533
    CRC32:afb3b9b3
    File Directory Location: C:\Users\Tester\AppData\Local\Temp\NeroInstallF...
    File Version, System, and Machine Information
    File Modification Date/Time:11/12/2019
    data1.cab 64-bit (x64) Expand for Detailed File Information +
    OS Version:Windows 10
    File Size:182474416
    File Date:11/12/2019
    MD5 Checksum:51b369c41a58cdd923cd0883ee22a440
    SHA1 Checksum:faa3266e121c96e4660cb2d135a1717c70026059
    SHA256 Checksum:25c85ca548550b0c79060cb9458dd75d81bd2d1d662b495c1578f88d4875f3e4
    CRC32:453650f6
    File Directory Location: C:\Users\Tester\AppData\Local\Temp\NeroInstallF...
    File Version, System, and Machine Information
    File Modification Date/Time:11/12/2019
    data1.cab 64-bit (x64) Expand for Detailed File Information +
    OS Version:Windows 10
    File Size:209337596
    File Date:11/12/2019
    MD5 Checksum:f7caa5546468f5caa7596c0a24375c6c
    SHA1 Checksum:4e7569b8ffa2589aacee1864814eff1d6e1915c6
    SHA256 Checksum:d69c97d9588a76e8eff0f156b6c1e49e37a6fc2221b70d6bddc3c45fff5f4369
    CRC32:3150e5dd
    File Directory Location: C:\Users\Tester\AppData\Local\Temp\NeroInstallF...
    File Version, System, and Machine Information
    File Modification Date/Time:11/12/2019
    data1.cab 64-bit (x64) Expand for Detailed File Information +
    OS Version:Windows 10
    File Size:577977
    File Date:11/12/2019
    MD5 Checksum:4e9524c23edd589af645eb8351293fdf
    SHA1 Checksum:0281d8cea87177d55b94a8e3e2f88fc7006b5b34
    SHA256 Checksum:cb72f5ec2aa2b855aa9bd494e55f331a339eb4a4f5b04f956b4b0bff844df0ab
    CRC32:3cbdae0d
    File Directory Location: C:\Users\Tester\AppData\Local\Temp\NeroInstallF...
    File Version, System, and Machine Information
    File Modification Date/Time:11/12/2019
    data1.cab 64-bit (x64) Expand for Detailed File Information +
    OS Version:Windows 10
    File Size:81064331
    File Date:11/12/2019
    MD5 Checksum:0522cae2801c7b3cda93a0b225050b60
    SHA1 Checksum:218813d5e8c169cc6a870c8884dd3f94efa383ba
    SHA256 Checksum:bd470c5fcffccaa9a1779abba78ec32371e7215d757cb5d61c40944d6446c667
    CRC32:f35335dd
    File Directory Location: C:\Users\Tester\AppData\Local\Temp\NeroInstallF...
    File Version, System, and Machine Information
    File Modification Date/Time:11/12/2019
    data1.cab 64-bit (x64) Expand for Detailed File Information +
    OS Version:Windows 10
    File Size:7078889
    File Date:11/12/2019
    MD5 Checksum:ff66a64e1c095f1fe9e4402ae300ca4d
    SHA1 Checksum:e71e3ce0d60f6e896605152eca8bcd43092bb8f7
    SHA256 Checksum:84d9e1e3372f6f0cd634cbcc9c92410703a20c79719c934ae83cba5f187c8bf2
    CRC32:fd0a08a8
    File Directory Location: C:\Users\Tester\AppData\Local\Temp\NeroInstallF...
    File Version, System, and Machine Information
    File Modification Date/Time:11/12/2019
    data1.cab 64-bit (x64) Expand for Detailed File Information +
    OS Version:Windows 10
    File Size:28867747
    File Date:11/12/2019
    MD5 Checksum:140daa04bdadd51e3fb0698a09eaf51b
    SHA1 Checksum:ff7d8f38d6fdab0394b067097a29daad1001c57b
    SHA256 Checksum:9cec8b74dc63368983560a97179beb97ad414906ee56707517004558a8dbf84b
    CRC32:ef1557e8
    File Directory Location: C:\Users\Tester\AppData\Local\Temp\NeroInstallF...
    File Version, System, and Machine Information
    File Modification Date/Time:11/12/2019
    error 1335 the cabinet file data1.cab

    youtube video

    How To install Windows 10 Cab files

    0 Comments

    Leave a Comment