Delphi runtime error 103

delphi runtime error 103

Appendix A - Delphi I/O Errors. Thanks goes out to Erik Martin for posting these Delphi IO errors on his web site. I/O Error 103: // IO Error 103L. “printed” book Mastering Delphi, the best selling Delphi book I have written. It is used to find a particular run-time error, not to search for a. Re:Runtime error 103 Peter: I think this is the right way to think about. occured. There must be a setting anywhere which changed (in the.

Delphi runtime error 103 - inquiry answer



 Binary Search tree runtime error 103 

AuthorMessage

Osmo Ronkan
#1 / 2

 Binary Search tree runtime error 103


Quote:


>Hi, all

>I have attached my files. I need help,please. I get a runtime error 103 at
>000044D5 when I run the program. The line is the ' PrintPreorder(Tree); in
>the main section of the program in the REPEAT section.

>What I want to know is, I use delphi 3 to do all my coding in, is there a
>bug in my Delphi software, or what do I do wrong?

First this is not a Delphi newsgroup. Second posting binaries is
prohibited.

Osmo



Wed, 18 Jun 1902 08:00:00 GMT 

Dr John Stockto
#2 / 2

 Binary Search tree runtime error 103


Quote:


>I have attached my files. I need help,please. I get a runtime error 103 at
>000044D5 when I run the program. The line is the ' PrintPreorder(Tree); in
>the main section of the program in the REPEAT section.

>What I want to know is, I use Delphi 3 to do all my coding in, is there a
>bug in my Delphi software, or what do I do wrong?

You posted encoded material to a text newsgroup.

You posted a Delphi question to a Pascal newsgroup.

You did not read the mini-FAQ.

You probably did not read the FAQ.

Quote:

>[ A UUEncoded file (allq2a.dpr) was included here. ]

>[ A UUEncoded file (integer.txt) was included here. ]

--

 <URL: http://www.merlyn.demon.co.uk/> TP/BP/Delphi/&c., FAQqy topics & links;
 <URL: ftp://garbo.uwasa.fi/pc/link/tsfaqp.zip> Timo Salmi's Turbo Pascal FAQ;
 <URL: http://www.merlyn.demon.co.uk/clpb-faq.txt> Pedt Scragg: c.l.p.b. mFAQ.


Wed, 18 Jun 1902 08:00:00 GMT 
 
 Page 1 of 1
 [ 2 post ] 

 Relevant Pages 


Delphi runtime error message table

61LThe print queue is full1415LUse local DIALOG window words1314LThe requested permission client does not127LThe specified process was not found1067LProcess terminated suddenly30LThe system cannot read from the specified drive72LThe specified printer or disk drive has been paused1794LThe redirector is in use and cannot be uninstalled1015LThe file structure of the registered file or the memory impression of the file is damaged or the file cannot be recovered1016LThe registration initialization I/O operation has an unrecoverable error, and the registration cannot complete the read, write, etc. operations1014LOne of the files containing system registration data has been restored successfully201LThe operating system cannot run %151LThe remote computer is unavailable1220LTrying to establish a LAN management server session, but many have been established71LNetwork request not accepted1816LThere is not enough quota to process the order1812LThe specified image file does not contain the resource part1815LThe specified resource language ID cannot be found in the image file1814LThe specified resource name cannot be found in the image file1813LThe specified resource type cannot be found in the image file1306LTwo version levels are not compatible207L2 ring stack in use200LThe code segment cannot be greater than or equal to 64KB1370LAn error occurred in the registration transaction delegation1369LThe transaction status of the registered subtree is incompatible with the requested operation143LThe system cannot replace the same drive or directory1440LScreen locked1382LThe length of the secret exceeds the maximum length allowed27LThe drive did not find the requested sector25LThe drive cannot find the specified area and track on the disk132LThe file pointer cannot be set on the specified device or file102LSignal settings cannot be turned off187LThe specified system signal name was not found105LThe signal’s previous owner relationship has ended121LThe signal overtime has arrived106LInsert the disk in drive 11118LThe serial device is not initialized, and the serial device is not installed1341LGUID allocation server is prohibited at this time1811LThe server is in use and cannot be uninstalled1342LAllow GUID to assign server at this time1056LService entity is already running1061LThe service cannot accept control messages at this time1055LService database lock1075LThe dependent service does not exist or has been marked for deletion1068LDependent service or group failed to start1058LThe specified service is prohibited and cannot be started1060LThe service specified as installed does not exist1073LThe specified service already exists1069LService cannot be started due to login failure1072LThe specified service has been marked for deletion1077LServices that did not start after booting are started1054LCannot spawn the service thread1062LService not started1053LThe service does not respond to startup or controls the request in time1066LThe service has returned a service-specific error code1070LAfter startup, the service hangs in the startup waiting state1219LThe provided certificate conflicts with the existing certificate set1433LLB_SETCOUNT sent to non-slow list box1103LTape access reached the set mark36LToo many shared files open70LRemote service is suspended or in the process of starting32LBecause the file is used by other processes, the process cannot access1115LSystem shutdown in process162LSignal suspended156LAccept process rejection signal1301LSome information to be mapped is not transmitted1371LAttempt to operate on a SAM account that is incompatible with the built-in account1372LThe requested operation cannot be performed on the specified group due to its built-in special group1373LThe requested operation cannot be performed on the specified user due to its built-in special group1001LRecursion too deep, stack overflow141LThe system tried to SUBST a drive to the directory of the substituted drive139LThe system tried to substitute a drive to the directory of the substituted drive0LOperation completed successfully999LError accessing paged file150LSystem tracking information is not in the specified CONFIG.SYS file or tracking is not allowed210LThe signal handle is not set1406LCreateWindows failed, creating a top-level window of the WS_CHILD class1375LAttempt to create a symbol for basic use, but the symbol is already in use. There can only be one basic symbol at a time56LNetwork BIOS command limit has been reached1384LDuring the login attempt, the user's security stack has too many security IDs1333LThe requested number of LUDs cannot be allocated in a single allocation214LToo many dynamic link modules are connected to the program or dynamic modules152LToo many signals have been set68LExceed the name limit of the LAN card4LThe system cannot open the file298LSend too many messages1381LThe maximum number of secrets that can be stored in a single system exceeds103LSignal cannot be reset100LCannot establish another system signal69LNetwork BIOS session exceeded1389LToo many SIDs specified155LCannot create another thread1790LNetwork login failed1788LThe fiduciary relationship between the main domain and the trusted domain failed1789LThe fiduciary relationship between the workstation and the primary domain failed1108LAttempt to lock a mechanism that lacks eject media1109LFailed to unload the media59LAn unexpected network error occurred1796LThe specified processor is unknown1798LUnknown print processor1797LUnknown print drive1305LThe version encountered or specified is unknown to the service1785LThe disk media cannot be recognized, it may be unformatted1005LThe volume does not contain a recognized file system1316LThe specified user already exists240LCancellation128LNo waiting child process1423LWindow is not a command box1420LWindow is not a valid dialog1408LInvalid window belongs to other thread29LThe system cannot write to the specified drive19LMedia write protection34LWrong disk in drive, insert %2 (volume serial number %3) into drive %11323LWhen updating the password, this state indicates that the provided password value is incorrect-1LInvalid input handle-2LInvalid input handle-7LInput parameter is out of range-5LLZFile file structure insufficient memory-6LIncorrect global handle-3LCorrupted compressed file structure-4LInsufficient output file space-8LUnrecognized compression algorithm0LNo error1768LAn addressing error occurred in the server1713LServer is already listening1711LObject UUID has been registered1746LConnection does not contain authentication information1726LThe remote procedure call failed1727LThe remote procedure call failed and cannot be executed1791LThe remote procedure call is already in the process of this thread1764LThe requested operation is not supported1720LCannot generate endpoint1740LDuplicate endpoint1760LEntrance already exists1761LEntrance not found1769LFloating point operations on the server divide by zero1771LFloating point overflow occurred on the server1770LFloating point underflow on the server1898LGroup member not found1755LIncomplete entry name1759LInterface not found1766LAn internal error occurred in RPC1749LInvalid security context1702LInvalid connection handle1734LInvalid array boundary1706LInvalid endpoint format1736LInvalid name syntax1707LInvalid network address1724LInvalid network options1900LObject universal unique identifier is empty1704LInvalid RPC protocol sequence1700LInvalid string connection1705LString UUID invalid1733LInvalid flag1709LInvalid timeout value1756LInvalid version option1742LThe maximum number of calls is too small1762LThe naming service is unavailable1718Lno connection1725LThere are no remote procedure calls in this thread1765LAllowed impersonation has no security context available1708LEndpoint not found1735LThe connection does not contain the entry point name1806LNot enough connections1757LNot enough members1719LNo protocol sequence1714LUnregistered protocol sequence1715LServer did not listen1710LObject UUID not found1721LInsufficient resources to complete the operation1745LProcess number out of range1728LRPC protocol error occurred1744LRPC protocol sequence not found1703LDoes not support RPC protocol sequence1731LThe server does not have enough memory to complete the operation1723LThe server is too busy to complete the operation1722LServer unavailable1743LString is too long1712LType UUID has been registered1748LUnknown authentication level1747LUnknown authentication service1741LUnknown authentication type1750LUnknown authorization service1717LUnknown interface1716LUnknown management type1737LCommand syntax is not supported1730LThe server does not support conversion syntax1732LType UUID is not supported1739LThere is no network address available to construct UUID1701LConnection handled as incorrect type1767LThe server tried to divide an integer by zero1783LStub received incorrect data1782LByte calculation is too small1781LEnumeration value out of bounds1772LThe available servers for automatic connection handling have been used up1780LNull reference pointer passed to stub1779LThe stub cannot get the call handle1773LThe file specified by DCERPCCHARTRANS cannot be opened1774LThe file containing the character conversion table is smaller than 512KB1777LContext handling changes during the call1776LThe context handle does not match any known1778LThe connection handle passed to the remote call does not match1775LEmpty upper and lower handles are passed as parameters

Protection Error: Error 103

Postby abwork » Tue 25 Jan 2005 21:34

Hello,
(Sorry for my english)
J testing myDAC (latest 60-day trial version, 20-Jan-05 MyDAC 3.50),
Delphi 5 Proffesional +SP1, WinXP Profesional +SP2 +latest updates; and:
1. Create Form1, add myQuery1 or myConnection1 - with default settings (from myDAC pack), compile, close compiled program > all ok,
2. create (adding) new blank Form2, compile, close compiled program > all ok,
3. create (adding) new blank Form3, compile ... close .. ok,
4. create ..blank Form4 .. compile .. close > all ok,
5. create (adding) new blank Form5, compile, close compiled program > .. after closing compiled program with 5 blank forms (only on Form1 is 1 component) program crashes with errors:
1: - "Access violation at address 40003AB0 in module vcl50.bpl. Read of address 01100094. Use step or Run to continue ..."
2: Error: "Runtime error 216 at 00002F30"
3: Protection Error: Error 103.

When J use more than 4 forms with component from myDAC packs (forms autocreate or dynamics (if dynamics - when J showing this forms)) always after closing compiled program J view these 3 errors.
If use more than 4 forms without myDAC component, all ok.

It's MS SP2 new protection problem or myDAC component?
I trying find component for my application in office with mySQL 4.1 database (my application has more than 4 forms).
J testing this situation on 2 different (hardware) computers (Windows XP SP2 and Delphi 5 Proff Add1 versions).

Maybe this errors from trial version restrictions?
Help me, myDAC is easy to use.

Adam

Syntax

function IOResult: Integer;

Description

Delphi has two ways to report an I/O error: runtime errors or the function. By default, Delphi reports I/O errors as runtime errors, and the unit maps runtime errors to exceptions. If you use the or directives to turn off I/O runtime errors, Delphi returns the status of input and output operations in the function. It is the programmer’s responsibility to call to test the success or failure of each I/O procedure or function call.

returns zero for success or an error code for failure. The error code might be a Windows error code, or one of the following Delphi error codes.

Error Number

Description

100

Read past end of file.

101

Disk is full.

102

has not yet been called.

103

The file is closed.

104

File not open for input.

105

File not open for output.

106

Incorrectly formatted input for .

After you call , the I/O result code is reset to zero. is a real function.

Tips and Tricks

  • Each thread keeps its own I/O result code, so be sure to call in the context of the correct thread.

  • It is the programmer’s responsibility to call after each I/O routine. If you don’t check , a subsequent I/O call can overwrite the old error code with a new one.

  • The unit maps I/O errors to the exception. This exception class maps only a few I/O error codes to strings. In a real application, ...

Get Delphi in a Nutshell now with the O’Reilly learning platform.

O’Reilly members experience live online training, plus books, videos, and digital content from nearly 200 publishers.

Start your free trial

Runtime Error 103

When starting Diamonds/PowerConnect or during use you get the error:

Runtime Error 103

bij [email protected]_IOTest()
bij Language.TTaalbox.VertaalForm(TScrollingWinControl FormTeVertalen, Boolean Optimize)
bij Language.TTaalbox.Execute(Byte Taal, Boolean AlleActieveForms, String PathTaalStr)
bij Dlg_CloseProgram.Units.Dlg_CloseProgram.ShowCloseForm(Boolean& SaveCurrentProject, Boolean& Return, Boolean OnlyCloseProject)
bij Main.TMainForm.FormCloseQuery(Object Sender, Boolean& CanClose)
bij Borland.Vcl.TCustomForm.CloseQuery()
bij Borland.Vcl.TCustomForm.Close()
bij Borland.Vcl.TApplication.WndProc(TMessage& Message)

Solution

Was this article helpful?

Related Articles

Having Java Errors after updating

  • ********** Robot program starting **********

  • Unhandled exception instantiating robot edu.wpi.first.hal.REVPHJNI edu.wpi.first.hal.util.UncleanStatusException: Code: -35025. Unknown error status

  • Error at frc.robot.subsystems.Climber.(Climber.java:16): Unhandled exception instantiating robot edu.wpi.first.hal.REVPHJNI edu.wpi.first.hal.util.UncleanStatusException: Code: -35025. Unknown error status

  • at edu.wpi.first.hal.REVPHJNI.initialize(Native Method)

  • at edu.wpi.first.wpilibj.PneumaticHub$DataStore.(PneumaticHub.java:32)

  • at edu.wpi.first.wpilibj.PneumaticHub.getForModule(PneumaticHub.java:103)

  • at edu.wpi.first.wpilibj.PneumaticHub.(PneumaticHub.java:142)

  • at edu.wpi.first.wpilibj.PneumaticsBase.getForType(PneumaticsBase.java:19)

  • at edu.wpi.first.wpilibj.DoubleSolenoid.(DoubleSolenoid.java:62)

  • at frc.robot.subsystems.Climber.(Climber.java:16)

  • at frc.robot.Robot.(Robot.java:25)

  • at edu.wpi.first.wpilibj.RobotBase.runRobot(RobotBase.java:322)

  • at edu.wpi.first.wpilibj.RobotBase.startRobot(RobotBase.java:463)

  • at frc.robot.Main.main(Main.java:23)

  • The robot program quit unexpectedly. This is usually due to a code error.
    The above stacktrace can help determine where the error occurred.
    See https://wpilib.org/stacktrace for more information.

  • Error at edu.wpi.first.wpilibj.RobotBase.runRobot(RobotBase.java:336): The robot program quit unexpectedly. This is usually due to a code error.

  • The above stacktrace can help determine where the error occurred.

  • See https://wpilib.org/stacktrace for more information.

  • Could not instantiate robot edu.wpi.first.hal.REVPHJNI!

  • Error at edu.wpi.first.wpilibj.RobotBase.runRobot(RobotBase.java:342): Could not instantiate robot edu.wpi.first.hal.REVPHJNI!

  • ********** Robot program starting **********

  • Unhandled exception instantiating robot edu.wpi.first.hal.REVPHJNI edu.wpi.first.hal.util.UncleanStatusException: Code: -35025. Unknown error status

  • Error at frc.robot.subsystems.Climber.(Climber.java:16): Unhandled exception instantiating robot edu.wpi.first.hal.REVPHJNI edu.wpi.first.hal.util.UncleanStatusException: Code: -35025. Unknown error status

  • at edu.wpi.first.hal.REVPHJNI.initialize(Native Method)

  • at edu.wpi.first.wpilibj.PneumaticHub$DataStore.(PneumaticHub.java:32)

  • at edu.wpi.first.wpilibj.PneumaticHub.getForModule(PneumaticHub.java:103)

  • at edu.wpi.first.wpilibj.PneumaticHub.(PneumaticHub.java:142)

  • at edu.wpi.first.wpilibj.PneumaticsBase.getForType(PneumaticsBase.java:19)

  • at edu.wpi.first.wpilibj.DoubleSolenoid.(DoubleSolenoid.java:62)

  • at frc.robot.subsystems.Climber.(Climber.java:16)

  • at frc.robot.Robot.(Robot.java:25)

  • at edu.wpi.first.wpilibj.RobotBase.runRobot(RobotBase.java:322)

  • at edu.wpi.first.wpilibj.RobotBase.startRobot(RobotBase.java:463)

  • at frc.robot.Main.main(Main.java:23)

  • The robot program quit unexpectedly. This is usually due to a code error.
    The above stacktrace can help determine where the error occurred.
    See https://wpilib.org/stacktrace for more information.

  • Error at edu.wpi.first.wpilibj.RobotBase.runRobot(RobotBase.java:336): The robot program quit unexpectedly. This is usually due to a code error.

  • The above stacktrace can help determine where the error occurred.

  • See https://wpilib.org/stacktrace for more information.

  • Could not instantiate robot edu.wpi.first.hal.REVPHJNI!

  • Error at edu.wpi.first.wpilibj.RobotBase.runRobot(RobotBase.java:342): Could not instantiate robot edu.wpi.first.hal.REVPHJNI!

  • ********** Robot program starting **********

  • Unhandled exception instantiating robot edu.wpi.first.hal.REVPHJNI edu.wpi.first.hal.util.UncleanStatusException: Code: -35025. Unknown error status

  • Error at frc.robot.subsystems.Climber.(Climber.java:16): Unhandled exception instantiating robot edu.wpi.first.hal.REVPHJNI edu.wpi.first.hal.util.UncleanStatusException: Code: -35025. Unknown error status

  • at edu.wpi.first.hal.REVPHJNI.initialize(Native Method)

  • at edu.wpi.first.wpilibj.PneumaticHub$DataStore.(PneumaticHub.java:32)

  • at edu.wpi.first.wpilibj.PneumaticHub.getForModule(PneumaticHub.java:103)

  • at edu.wpi.first.wpilibj.PneumaticHub.(PneumaticHub.java:142)

  • at edu.wpi.first.wpilibj.PneumaticsBase.getForType(PneumaticsBase.java:19)

  • at edu.wpi.first.wpilibj.DoubleSolenoid.(DoubleSolenoid.java:62)

  • at frc.robot.subsystems.Climber.(Climber.java:16)

  • at frc.robot.Robot.(Robot.java:25)

  • at edu.wpi.first.wpilibj.RobotBase.runRobot(RobotBase.java:322)

  • at edu.wpi.first.wpilibj.RobotBase.startRobot(RobotBase.java:463)

  • at frc.robot.Main.main(Main.java:23)

  • The robot program quit unexpectedly. This is usually due to a code error.
    The above stacktrace can help determine where the error occurred.
    See https://wpilib.org/stacktrace for more information.

  • Error at edu.wpi.first.wpilibj.RobotBase.runRobot(RobotBase.java:336): The robot program quit unexpectedly. This is usually due to a code error.

  • The above stacktrace can help determine where the error occurred.

  • See https://wpilib.org/stacktrace for more information.

  • Could not instantiate robot edu.wpi.first.hal.REVPHJNI!

  • Error at edu.wpi.first.wpilibj.RobotBase.runRobot(RobotBase.java:342): Could not instantiate robot edu.wpi.first.hal.REVPHJNI!

  • Killing previously running FRC program…

  • FRC pid 3518 did not die within 500 ms. Force killing with kill -9

  • delphi runtime error 103

    0 Comments

    Leave a Comment