1641 error code

1641 error code

The installer has initiated a restart. This message is indicative of a success. pkg.remove on the salt master console output shows: vmware_view-. If you receive an error code "1641,".NET 3.5 has successfully installed but did not have access rights to reboot the system. Please restart and. skip to main text. Canon. Return to Application · Notes on Site Usage and Cookies · G6000 series · List of Support Code for Error; 1641. 1641. 1641 error code

1641 error code - remarkable

1641

What to Do

To check the remaining ink level, visually inspect the remaining ink in the ink tank. The action you should take to resume operating the printer depends upon which function(s) of the printer you intend to use.

1. To PRINT or COPY

If you intend to PRINT or COPY, you should take one of the following steps:

(a) Press the OK button on the printer. If there is some residual amount of ink in the tank(s), you will be able to PRINT or COPY until the remaining ink is depleted, although image quality may diminish as the remaining ink in the tank(s) becomes depleted.

Please note that if you continue to PRINT or COPY when the remaining ink is below the lower limit line, the printer may consume excess ink as it attempts to return to normal image quality after it is refilled with ink.

OR

(b) Refill the ink tank with the corresponding color of ink to above the single dot shown on the ink tank.

→ Refilling Ink Tanks

You will then be able to PRINT or COPY.

2. To SCAN or FAX

If you intend to SCAN (or FAX if your printer has that capability), you should take one of the following steps:

(a) Press the OK button on the printer. You will then be able to SCAN (or FAX if your printer has that capability).

OR

(b) Refill the ink tank with the corresponding color of ink to above the single dot shown on the ink tank. 

→ Refilling Ink Tanks

AutoCAD

Solution:

A few of the most common errors are:

Success

ERROR_SUCCESS 0 The action completed successfully.
User-added image 

ERROR_SUCCESS_REBOOT_INITIATED 1641 The installer has initiated a restart. This message is indicative of a success.
User-added image

Fail
ERROR_INSTALL_PACKAGE_OPEN_FAILED 1619 This installation package could not be opened. Verify that the package exists and is accessible, or contact the application vendor to verify that this is a valid Windows Installer package.
User-added image

ERROR_INSTALL_FAILURE 1603 A fatal error occurred during installation
(In the example below the MaterialLibrary that was getting installed was an older version than already installed)
User-added image 


User-added image

Third party components such as dot Net:

0 Installation completed successfully. 
1602 The user canceled installation. 
1603 A fatal error occurred during installation. 
1641 A restart is required to complete the installation. This message indicates success. 
3010 A restart is required to complete the installation. This message indicates success. 
5100 The user's computer does not meet system requirements.

You may also have SCCM specific errors such as cache error, but those are not Autodesk specific.

Windows Installer error codes

Windows Installer error codes

Right-click Windows Installer, and then click Properties. If the Startup type box is set to Disabled, change it to Manual. Click OK to close the Properties window. Right-click the Windows Installer service, and then click Start. The service should start without errors. Try to install or to uninstall again.

To upgrade to Windows 10, you need enough space on your hard drive for the installation to take place. To view how much hard drive space is available on your computer, select the Start button, then in the search box on the taskbar, type File Explorer (known as Windows Explorer in Windows 7).

Code Message; 1101: Could not open file stream: [2]. System error: [3] 1259: This error code only occurs when using Windows Installer version 2.0 and Windows XP or later.

Steps to Setup Windows Computers: Check the network connection. Get your device drivers up-to-date; Set your preferred browse. Now install a password manager.

GetLastError error codes

0: The operation completed successfully. 1: Incorrect function. 2: The system cannot find the file specified. 3: The system cannot find the path specified.

MSDN Community Support Please remember to click "Mark as Answer" the responses that resolved your issue, and to click "Unmark as Answer" if not. This can be beneficial to other community members reading this thread.

error code 1641.

Error code 1641, ERROR_SUCCESS_REBOOT_INITIATED, indicates, "The installer has initiated a restart. This message is indicative of a success." By default, PDQ Deploy includes this code in the Success Codes. See, Install Step Properties.

Reboot Return Codes – The installation was successful and a reboot is required. Note: 1604 and 1641 are actually errors but SCCM classes all reboot codes as a “success”. Execution Failure Retry Error Codes – The installation failed but can be retried.

MSI Return Code. Description. 0. This is (almost always) considered successful and should be treated as such except in very rare cases. 1641. This return code means that the installation required the target to reboot AND that a reboot was initiated.

MSI Error 1708

Windows Installer is attempting to install an app that is already installed on your PC. The folder that you are trying to install the Windows Installer package to is encrypted. The drive that contains the folder that you are trying to install the Windows Installer package to is accessed as a substitute drive.

MSI error code 1603

Error 1603: A fatal error occurred during installation. If you click OK in the message box, the installation rolls back.

The 1603 error is an MSI error code indicating a failure that is generic, but computer-specific. This document lists possible suggestions to solve this error. The following table lists known causes of 1603 errors when installing Adobe software.

The MSI can be downloaded from our Downloads Page by selecting the version from the dropdown, then click the MSI via HTTP download link. Press Windows+R on your keyboard to open the Windows Run window. Click Browse. Click All Files. Browse to where the MSI (from step 1) was downloaded to. Select the MSI and click Open.

A 1603 essentially means “an error occurred” trying to commit the change, causing msiexec.exe to “backout the change”. This type of error is either caused by msi misengineering (most vendor msi are misengineered) or by an “machine specfic issue”. So Patrick Pepin makes an excellent suggetion to check the msi vendor.

You may encounter an error with a code of 1603 when you are attempting to install something on your Windows. The error message is basically something like “ Error: -1603 Fatal error during installation. ” It usually occurs when you are using a Windows Installer package to install the program.

2020 TurboTax updater fails with Microsoft Installer error 1603 Windows 10 Pro, Turbotax 2020 Premier. No problem with any other program updates. No option to bypass updates so can't even open Turbotax.

On installing the software for new Wireless Optical desktop keyboard and mouse 1000, received error code 1603, unable to install a required component, Windows Installer.

Error code 1642

Error code 1642. Windows Installer can create logs to help troubleshoot issues with installing software packages.

The error code 1642 means: The installer cannot install the upgrade patch because the program being upgraded may be missing, or the upgrade patch updates a different version of the program. Verify that the program to be upgraded exists on your computer and that you have the correct upgrade patch.

Windows installer returns error code 1642, and the text of the pop-up window is as follows: "The upgrade patch cannot be installed by the Windows Installer service because the program to be upgraded may be missing, or the upgrade patch may update a different version of the program.

This website uses cookies. By clicking OK, you consent to the use of cookies. Click Here to learn more about how we use cookies.

Error code 1636

how do you resolve a error code 1636? while installing turbo tax had power failure now can't remove or load the software and get error code 1636 This thread is locked. You can follow the question or vote as helpful, but you cannot reply to this thread.

What is the cost to diagnose the P1636 code Labor: 1.0 The cost to diagnose the P1636 code is 1.0 hour of labor. The auto repair labor rates vary widely across the country, and even within the same city. Most auto repairs shops charge between $75 and $150 per hour.

P1636 FORD Description The Powertrain Control Module (PCM) monitors the communications with the Inductive Signature Chip. The Diagnostic Trouble Code (DTC) indicates the Powertrain Control Module has lost communication with the Inductive Signature Chip.

This website uses cookies. By continuing to use this site and/or clicking the "Accept" button you are providing consent Quest Software and its affiliates do NOT sell the Personal Data you provide to us either when you register on our websites or when you do business with us.

SCCM Application fails: Unmatched exit code (1636) is considered an execution failure.


You Might Like:

You must have faced this following exit code 1641 (ERROR_SUCCESS_REBOOT_INITIATED) after install, repair or uninstall some MSI based applications. 

I would say this is not error code, actually it’s success exit code which get generated by Windows installer based on the MSI file behaviour. Now understand how it could create problem for you and your users with following scenario: 

Let’s assume you’re a SCCM/System administrator and responsible to deploy an application (e.g., 7-Zip 21.07) with below order: 

Understand the Scenario:

  • Pre-Install Steps 
    • Uninstall previous version 7-Zip 19.00, 
    • Remove leftover some folders (e.g., C:\Program Files (x86)\7-Zip), 
  • Install Steps 
    • Install new version 7-Zip 21.07 

You prepare an install script and deploy application 7-Zip 21.07 through Configuration manager (formerly known as SCCM). 

Later, you get multiple calls referring that user’s system are getting rebooted forcefully without any notification while installing 7-Zip 21.07 application.  

Cause for Hard Reboot Exit Code 1641 (ERROR_SUCCESS_REBOOT_INITIATED)

Now here troubleshooting comes in the action. After rebooting some affected systems, you found that only previous version of 7-Zip 19.00 task has been executed successfully (Exit error code 1641, ERROR_SUCCESS_REBOOT_INITIATED) and then system rebooted immediately without execute next steps. 

Log File of MSI Application where we get hard reboot Exit Code 1641 (ERROR_SUCCESS_REBOOT_INITIATED)
  • Pre-Install Steps
    • Uninstall previous version 7-Zip 19.00, (Executed with exit error code 1641)
    • Remove leftover some folders (C:\Program Files (x86)\7-Zip), (Didn’t executed) 
  • Install Steps 
    • Install new version 7-Zip 21.07 (Didn’t executed) 

Now there are two issues for you: 

  • First, whole script was not able to execute cause of that new version hasn’t installed, 
  • Second, user’s systems are getting reboot forcefully.

 It could create a big problem for users when users are busy in an important works or giving presentation in a meeting and don’t want their system to get forcefully reboot without giving any notification or way to stop it.

If you’ve worked with MSI file, then can suppress this hard reboot by using following parameters for most of the applications:

  • REBOOT=ReallySuppress 
  • /norestart 

But, for some applications this parameter doesn’t work and still system get hard reboot. 

Like you, I also tried multiple ways to prevent this and after multiple attempts I prepare a working solution to overcome this issue.

Solution for Hard Reboot Exit Code 1641 (ERROR_SUCCESS_REBOOT_INITIATED) 

Based on above scenario, we need to add a schedule reboot step in starting of script:

In above command I’ve used 43200 seconds (~ 10 hours), you may change but that’s not require because end of script we’ll cancel the scheduled reboot (cmd /c shutdown /a). 

Let me show you how it’s look like when you execute this commands: 

So now your script steps will look like this: 

  • Pre-Install Steps 
    • Schedule a reboot (cmd /c shutdown -r -t 43200) 
    • Uninstall previous version 7-Zip 19.00, 
    • Remove leftover some folders (C:\Program Files (x86)\7-Zip), 
  • Install Steps 
    • Install new version 7-Zip 21.07 
    • Cancel the scheduled reboot (cmd /c shutdown /a

This trick will work with any MSI, or EXE based installation where you want to prevent hard reboot Exit code 1641 of client systems.

Understand the Concept of Prevent Hard Reboot (ERROR_SUCCESS_REBOOT_INITIATED)

You’ll get following notification when you already schedule a shutdown task on system:

how to stop hard reboot Exit Code 1641 (ERROR_SUCCESS_REBOOT_INITIATED)

You will receive following notification while cancel the scheduled shutdown task:

How to cancel pre-schedule Shutdown on system to prevent hard reboot Exit Code 1641 (ERROR_SUCCESS_REBOOT_INITIATED)

Now here you’ll understand why MSI exit code 1641 hard reboot unable to reboot system if you’ve already scheduled a Shutdown on system.

You can see in following screenshot. If you try to schedule shutdown task second time without cancel previous shutdown, you’ll get message that “A system shutdown has already been scheduled.(1190)”.

That means when you’ve already set shutdown manually with some delay, then Windows installer unable to schedule second shutdown on the event of MSI exit code 1641 hard reboot. Then this Hard Reboot exit code 1641 (ERROR_SUCCESS_REBOOT_INITIATED) get change to Soft Reboot exit code 3010 (ERROR_SUCCESS_REBOOT_REQUIRED). Which is OK. 🙂

Summary:

In this article we talked about how we can prevent system from forcefully reboot on then event of MSI Exit code 1641 hard reboot (ERROR_SUCCESS_REBOOT_INITIATED) while installing, repairing or uninstalling applications on client systems.

I hope this workaround help you in this scenario and we also love to hear your feedback if you know any other trick to overcome this issue.

Please check this page for more learning resources.

Please also take the following course for more learning….

Advance IT Troubleshooting for Desktop Support Professional

Please Share ThisShare this content

You Might Also Like

0Action completed successfully.ERROR_SUCCESS13The data is invalid.ERROR_INVALID_DATA87One of the parameters was invalid.ERROR_INVALID_PARAMETER120This function is not available for this platform. It is only available on Windows 2000 and Windows XP with Window Installer version 2.0.ERROR_CALL_NOT_IMPLEMENTED1259This error code only occurs when using Windows Installer version 2.0 and Windows XP or later. If Windows Installer determines a product may be incompatible with the current operating system, it displays a dialog informing the user and asking whether to try to install anyway. This error code is returned if the user chooses not to try the installation.ERROR_APPHELP_BLOCK1601The Windows Installer service could not be accessed. Contact your support personnel to verify that the Windows Installer service is properly registered.ERROR_INSTALL_SERVICE_FAILURE1602User cancel installation.ERROR_INSTALL_USEREXIT1603Fatal error during installation.ERROR_INSTALL_FAILURE1604Installation suspended, incomplete.ERROR_INSTALL_SUSPEND1605This action is only valid for products that are currently installed.ERROR_UNKNOWN_PRODUCT1606Feature ID not registered.ERROR_UNKNOWN_FEATURE1607Component ID not registered.ERROR_UNKNOWN_COMPONENT1608Unknown property.ERROR_UNKNOWN_PROPERTY1609Handle is in an invalid state.ERROR_INVALID_HANDLE_STATE1610The configuration data for this product is corrupt. Contact your support personnel.ERROR_BAD_CONFIGURATION1611Component qualifier not present.ERROR_INDEX_ABSENT1612The installation source for this product is not available. Verify that the source exists and that you can access it.ERROR_INSTALL_SOURCE_ABSENT1613This installation package cannot be installed by the Windows Installer service. You must install a Windows service pack that contains a newer version of the Windows Installer service.ERROR_INSTALL_PACKAGE_VERSION1614Product is uninstalled.ERROR_PRODUCT_UNINSTALLED1615SQL query syntax invalid or unsupported.ERROR_BAD_QUERY_SYNTAX1616Record field does not exist.ERROR_INVALID_FIELD1618Another installation is already in progress. Complete that installation before proceeding with this install.ERROR_INSTALL_ALREADY_RUNNING1619This installation package could not be opened. Verify that the package exists and that you can access it, or contact the application vendor to verify that this is a valid Windows Installer package.ERROR_INSTALL_PACKAGE_OPEN_FAILED1620This installation package could not be opened. Contact the application vendor to verify that this is a valid Windows Installer package.ERROR_INSTALL_PACKAGE_INVALID1621There was an error starting the Windows Installer service user interface. Contact your support personnel.ERROR_INSTALL_UI_FAILURE1622Error opening installation log file. Verify that the specified log file location exists and is writable.ERROR_INSTALL_LOG_FAILURE1623This language of this installation package is not supported by your system.ERROR_INSTALL_LANGUAGE_UNSUPPORTED1624Error applying transforms. Verify that the specified transform paths are valid.ERROR_INSTALL_TRANSFORM_FAILURE1625This installation is forbidden by system policy. Contact your system administrator.ERROR_INSTALL_PACKAGE_REJECTED1626Function could not be executed.ERROR_FUNCTION_NOT_CALLED1627Function failed during execution.ERROR_FUNCTION_FAILED1628Invalid or unknown table specified.ERROR_INVALID_TABLE1629Data supplied is of wrong type.ERROR_DATATYPE_MISMATCH1630Data of this type is not supported.ERROR_UNSUPPORTED_TYPE1631The Windows Installer service failed to start. Contact your support personnel.ERROR_CREATE_FAILED1632The temp folder is either full or inaccessible. Verify that the temp folder exists and that you can write to it.ERROR_INSTALL_TEMP_UNWRITABLE1633This installation package is not supported on this platform. Contact your application vendor.ERROR_INSTALL_PLATFORM_UNSUPPORTED1634Component not used on this machineERROR_INSTALL_NOTUSED1635This patch package could not be opened. Verify that the patch package exists and that you can access it, or contact the application vendor to verify that this is a valid Windows Installer patch package.ERROR_PATCH_PACKAGE_OPEN_FAILED1636This patch package could not be opened. Contact the application vendor to verify that this is a valid Windows Installer patch package.ERROR_PATCH_PACKAGE_INVALID1637This patch package cannot be processed by the Windows Installer service. You must install a Windows service pack that contains a newer version of the Windows Installer service.ERROR_PATCH_PACKAGE_UNSUPPORTED1638Another version of this product is already installed. Installation of this version cannot continue. To configure or remove the existing version of this product, use Add/Remove Programs on the Control Panel.ERROR_PRODUCT_VERSION1639Invalid command line argument. Consult the Windows Installer SDK for detailed command line help.ERROR_INVALID_COMMAND_LINE1640Installation from a Terminal Server client session not permitted for current user.ERROR_INSTALL_REMOTE_DISALLOWED1641The installer has started a reboot. This error code not available on Windows Installer version 1.0.ERROR_SUCCESS_REBOOT_INITIATED1642The installer cannot install the upgrade patch because the program being upgraded may be missing or the upgrade patch updates a different version of the program. Verify that the program to be upgraded exists on your computer and that you have the correct upgrade patch. This error code is not available on Windows Installer version 1.0.ERROR_PATCH_TARGET_NOT_FOUND1643The patch package is not permitted by system policy. This error code is available with Windows Installer versions 2.0 or later.ERROR_PATCH_PACKAGE_REJECTED1644One or more customizations are not permitted by system policy. This error code is available with Windows Installer versions 2.0 or later.ERROR_INSTALL_TRANSFORM_REJECTED3010A reboot is required to complete the install. This does not include installs where the ForceReboot action is run. This error code not available on Windows Installer version 1.0.ERROR_SUCCESS_REBOOT_REQUIRED

Msi Error Code 1641 - Updated September 2022 - Top Results You're Keen On

  • 1. How many Msi Error Code 1641 results are available?

    According to CouponXoo's tracking system, there are currently 20 Msi Error Code 1641 results. These deal offers are from many sources, selected by our smart and comprehensive system on coupon codes, discounts, and deals.

  • 2. Tips to save money with Msi Error Code 1641 offer

    You can hunt for discount codes on many events such as Flash Sale, Occasion like Halloween Deals, Back to School Sale, Christmas & New Year Sale-Off, Back Friday - Cyber Monday Biggest Sale of the Year,…which you can get the best discounts. If you buy regularly at a store, do not hesitate to contact us, CouponXoo will support you with an exclusive discount code.

  • 3. How can I keep track of information on Msi Error Code 1641?

    The best way to update deals from an online store is to visit their homepage regularly. In parallel, you should also refer to the websites of Discounts, Deals,... and you should not ignore CouponXoo, which is a huge database of discount and coupon codes. CouponXoo always updates the latest coupon codes periodically, which ensures that you always have the latest ones...

  • 4. Why do I have to wait for a bit when searching Msi Error Code 1641?

    The reason is there are many Msi Error Code 1641 results we have discovered especially updated the new coupons and this process will take a while to present the best result for your searching. This often takes 0.25 seconds with a normal search and around 1 sec for a difficult search.

  • Consider: 1641 error code

    1641 error code
    DSOUND .DLL ERROR
    ERROR LIBIPSEC FAILED PFKEY OPEN
    Runtime error 713 vb
    Sony serious error

    For Admins: Windows Installer Error Codes (Exit Codes)

    1101Could not open file stream: [2]. System error: [3]1259This error code only occurs when using Windows Installer version 2.0 and Windows XP or later. If Windows Installer determines a product may be incompatible with the current operating system, it displays a dialog informing the user and asking whether to try to install anyway. This error code is returned if the user chooses not to try the installation1301Cannot create the file '[2]'. A directory with this name already exists.1302Please insert the disk: [2]1303The Installer has insufficient privileges to access this directory: [2].1304Error Writing to File: [2]1305Error Reading from File: [2]; System error code: [3]1306The file '[2]' is in use. If you can, please close the application that is using the file, 1641 error code, then click Retry.1307There 1641 error code not enough disk space remaining to install this file: [2]. If you can, free up some disk space, and click Retry, 1641 error code click Cancel to exit.1308Source file not found: [2]1309Error attempting to open the source file: [3]. System error code: [2]1310Error attempting to create the destination file: [3]. System error code: [2]1311Could not locate source file cabinet: [2].1312Cannot create the directory '[2]'. A file with this name already exists. Please rename or remove the file and click retry, or click Cancel to exit.1313The volume [2] is currently unavailable. Please select another.1314The specified path '[2]' is unavailable.1315Unable to write to the specified folder: [2].1316A network error occurred while attempting to access error site or page not found from the file: [2]1317An error occurred while attempting to create the directory: [2]1318A network error occurred while attempting to create the directory: [2]1319A network error occurred while attempting to open the source file cabinet: [2].1320The specified path is too long: '[2]'1321The Installer has insufficient privileges to modify this file: [2].1322A portion of the folder path '[2]' is invalid. It is either empty or exceeds the length allowed by the system.1323The folder path '[2]' contains words that are not valid in folder paths.1324The folder path '[2]' contains an invalid character.1325'[2]' is not a valid short file name.1326Error getting file security: [3] GetLastError: [2]1327Invalid Drive: [2]1328Error applying patch to file [2]. It has probably been updated by other means, and can no longer be modified by this patch. For more information contact your patch vendor. System Error: [3]1329A file that is required cannot be installed because the cabinet file [2] is not digitally signed. This may indicate that the cabinet file is corrupt.1330A file that is required cannot be installed because the cabinet file [2] has an invalid digital signature. This may indicate that the cabinet file is corrupt.{ Service call 142 fatall error [3] was returned by WinVerifyTrust.}1331Failed to hp laserjet 1320 fatal error copy [2] file: CRC error.1332Failed to correctly move [2] file: CRC error.1333Failed to correctly patch [2] file: CRC error.1334The file '[2]' cannot be installed because the file cannot be found in cabinet file '[3]'. This could indicate a network error, an error reading from the CD-ROM, or a problem with this package.1335The cabinet file '[2]' required for this installation is corrupt and cannot be used. This could indicate a network error, an error reading from the CD-ROM, or a problem with this package.1336There was an error creating a temporary file that is needed to complete this 1641 error code. Folder: [3]. System error code: [2]1401Could not create key: [2]. System error [3].1402Could not open key: [2]. System error [3].1403Could not delete value [2] from key [3]. System error [4].1404Could not delete key [2]. System error [3].1405Could not read value [2] from key [3]. System error [4].1406Could not write value [2] to key [3]. System error [4].1407Could not get value names for key [2]. System error [3].1408Could not get sub key names for key [2]. System error [3].1409Could not read security information for key [2]. System error [3].1410Could not increase the available registry space. [2] KB of free registry space is required for the installation of this application.1500Another installation is in progress. You must complete that installation before continuing this one.1501Error accessing secured data. Please make sure the Windows Installer is configured properly and try the install again.1502User '[2]' has previously initiated an install for product '[3]'. That user will need to run that install again before they can use that product. 1641 error code current install will now continue.1503User '[2]' has previously initiated an install for product '[3]'. That user will need to run that install again before they can use that product.1601The Windows Installer service could not be accessed. Contact your support personnel to verify that the Windows Installer service is properly registered1601Out of disk space -- Volume: '[2]'; required space: [3] KB; available 1641 error code [4] KB1602User cancelled installation1602Are you sure you want to cancel?1603Fatal error during installation1603The file [2][3] is being held in use by the following process: Name: [4], Id: [5], Window Title: '[6]'.1604Installation suspended, incomplete1604The product '[2]' is already installed, and has prevented the installation of this product.1605This action is only valid for products that are currently installed1605Out of disk space -- Volume: '[2]'; required space: [3] KB; available space: [4] KB. If rollback is disabled, enough space is available. Click 'Cancel' to quit, 'Retry' to check available disk space again, or 'Ignore' to continue without rollback.1606Feature ID not registered1606Could not access location [2].1607Component ID not registered1607The following applications should be closed before continuing the install:1608Unknown property1608Could not find any previously installed compliant products on the machine for installing this product1609An error occurred while applying security settings. [2] is not a valid user or group. This could be a problem with the package, or a problem connecting to a domain controller on the network. Check your network connection and click Retry, or Cancel to end the install. Unable to locate the user's SID, system error [3]1610The configuration data for this product is corrupt. Contact your support personnel1611Component qualifier not present1612The installation source for this product is not available. Verify that the source exists and that you can access it1613This installation package cannot be installed by the Windows Installer service. You must install a Windows service pack that contains a newer version of the Windows Installer service1614Product is uninstalled1615SQL query syntax invalid or unsupported1616Record field does not exist1618Another installation is already in progress. Complete that installation before proceeding with this install1619This installation package could not be opened. Verify that the package exists and that you can access it, or contact the application vendor to verify that this is a valid Windows Installer package1620This installation package could not be opened. Contact the application vendor to verify that this is a valid Windows Installer package1621There was an error starting the Windows Installer service user interface. Contact your support personnel1622Error opening installation log file. Verify that the specified log file location exists and is writable1623This language of how to repair hwk box error 20 installation package is not supported by your system1624Error applying transforms. Verify that the specified transform paths are valid1625This installation is forbidden by system policy. Contact your system administrator1626Function could not be executed1627Function failed during execution1628Invalid or unknown table specified1629Data supplied is of wrong type1630Data of this type is not supported1631The Windows Installer service failed to start. Contact your support personnel1632The temp folder is either full or inaccessible. Verify that the temp folder exists and that you can write to it1633This installation package 1641 error code not supported on this platform. Contact your application vendor1634Component not used on this vertex error css patch package could not be opened. Verify that 1641 error code patch package exists and that you can access it, or contact the application vendor to verify that this is a valid Windows Installer patch package1636This patch package could not be opened. Contact the application vendor to verify that this is a valid Windows Installer patch package1637This patch package cannot be processed by the Windows Installer service. You must install a Windows service pack that contains a newer version of the Windows Installer service1638Another version of this product is already installed. Installation of this version cannot continue. To configure or remove the existing version of this product, use Add/Remove Programs on the Control Panel1639Invalid command line argument. Consult the Windows Installer SDK for detailed command line help1640Installation from a Terminal Server client session not permitted for current user1641The installer has 1641 error code a reboot. This error code not available on Windows Installer version 1.01642The installer cannot install the upgrade patch because the program being upgraded may be missing or the upgrade patch updates a different version of the program. Verify that the program to be upgraded exists on your computer and that you have the correct upgrade patch. This error code is not available on Windows Installer version 1.01643The patch package is not permitted by system policy. This error code is available with Windows Installer versions 2.0 or later1644One or more customizations are not permitted by system policy. This error code is available with Windows Installer versions 2.0 or later.1701[2] is not a valid entry for a product ID.1702Configuring [2] cannot be completed until you restart your system. To restart now and resume configuration click Yes, 1641 error code, or click 1641 error code to stop this configuration.1703For the configuration changes made to [2] to take effect you must restart your system. To restart now click Yes, or click No if you plan to manually restart at a 1641 error code time.1704An install for [2] is currently suspended. You must undo the changes made by that install to continue, 1641 error code. Do you want to undo those changes?1705A previous install for this product is in progress. You must undo the changes made by that install to continue. Do you want to undo those changes?1706No valid source could be found for product [2].1707Installation operation completed successfully.1708Installation operation failed.1709Product: [2] -- [3]1710You may either restore your computer to its previous 1641 error code or continue the install later. Would you like to restore?1711An error occurred while writing installation information to disk. Check to make sure enough disk space is available, and click Retry, or Cancel to end the install.1712One or more of the files required to restore your computer to its previous state could not be found. Restoration will not be possible.1713[2] cannot install one of its required products. Contact your technical support group. System Error: [3].1714The older version of [2] cannot be removed. Contact your technical support group. System Error [3].1715Installed [2].1716Configured [2].1717Removed [2].1718File [2] was rejected by digital signature policy.1719The Windows Installer Service could not be accessed. Contact your support personnel to verify that edbengineerror insufficient disk space is properly registered and enabled.1720There is a problem with this Windows Installer package. A script required for this install to complete could not be run. Contact your support personnel or package vendor. Custom action [2] script error [3], 1641 error code, [4]: [5] Line [6], Column [7], [8]1721There is a problem with this Windows Installer package. A program required for this install to complete could not be run. Contact your support personnel or package vendor. Action: [2], 1641 error code, location: [3], command: [4]1722There is a problem with this Windows Installer package. A program run as part of the setup did not finish 1641 error code expected. Contact your support personnel or package vendor. Action [2], location: [3], command: [4]1723There is a problem with this Windows Installer package. A DLL required for this install to complete could not be run. Contact your support personnel or package vendor. Action [2], entry: [3], library: [4]1724Removal completed successfully.1725Removal failed.1726Advertisement completed successfully.1727Advertisement failed.1728Configuration completed successfully.1729Configuration failed.1730Removal failed.1801The path [2] is not valid1802Out of memory1803There is no disk in drive [2]. Please, 1641 error code, insert one and hit Retry, or hit Cancel to go back to the previously selected volume.1804There is no disk in drive [2]. Please, insert one and hit Retry, or hit Cancel to return to the browse dialog and select a different volume.1805The path [2] does not exist1806You have insufficient privileges to read this folder.1807A valid destination folder for the install could not be determined.1901Error attempting to read from the source install database: [2]1902Scheduling reboot operation: Renaming file [2] to [3]. Must reboot to complete operation.1903Scheduling reboot operation: Deleting file [2]. Must reboot to complete operation.1904Module [2] failed to register. HRESULT [3].1905Module [2] 1641 error code to unregister. HRESULT [3].1906Failed to cache package [2]. Error: [3]1907Could not register font [2]. Verify that you that you have sufficient permissions to install fonts, and that the system supports this font.1908Could not unregister font [2]. Verify that you that you have sufficient permissions to remove fonts.1909Could not create Shortcut [2], 1641 error code. Verify that the destination folder exists and that you can access it.1910Could not remove Shortcut [2]. Verify that the shortcut file exists and that you can access it.1911Could not register type library for file [2]. Contact your support personnel.1912Could not unregister type library for file [2]. Contact your support personnel.1913Could not update the ini file [2][3]. Verify that the file exists and that you can access it.1914Could not schedule file [2] to replace file [3] on reboot. Verify that you have write permissions to file [3].1915Error removing ODBC driver manager, ODBC error [2]: [3]. Contact your support personnel.1916Error installing ODBC driver manager, ODBC error [2]: [3]. Contact your support personnel.1917Error removing ODBC driver: [4], ODBC error [2]: [3]. Verify that you have sufficient privileges to remove ODBC drivers.1918Error installing ODBC driver: [4], ODBC error [2]: [3]. Verify that the file [4] exists and that you can access it.1919Error configuring ODBC data source: [4], ODBC error [2]: [3]. Verify that the file [4] exists and that you can access it.1920Service '[2]' ([3]) failed to start. Verify that you have sufficient privileges to start system services.1921Service '[2]' ([3]) could not be stopped. Verify that you have sufficient privileges to stop system services.1922Service '[2]' ([3]) could not be deleted. Verify that you have sufficient privileges to remove system services.1923Service '[2]' ([3]) could not be installed. Verify that you have sufficient privileges to install system services.1924Could not update environment variable '[2]'. Verify that you have sufficient privileges to modify environment variables.1925You do not have sufficient privileges to complete this installation for all users of the machine. Log on as administrator and then retry this installation.1926Could not set 1641 error code security for file '[3]'. Error: [2]. Verify that you have sufficient privileges to modify the security permissions for this file.1927The installation requires COM+ Services to be installed.1928The installation failed to install the COM+ Application.1929The installation failed to remove the COM+ Application.1930The description for service '[2]' ([3]) could not be changed.1931The Windows Installer service cannot update the system file [2] because the file is protected by Windows. You may need to update your operating system for this program to work correctly, 1641 error code. Package version: [3], OS Protected version: [4]1932The Windows Installer service cannot update the protected Windows file [2]. Package version: [3], OS Protected version: [4], SFP Error: [5]1933The Windows Installer service cannot update one or more protected Windows files. SFP Error: [2]. List of protected files:\r\n[3]1934User installations are disabled via policy on the machine.1935An error occurred during the installation of assembly component [2]. HRESULT: [3]. {{assembly interface: [4], function: [5], assembly name: [6]}}2101Shortcuts not supported by the OS2102Invalid .INI action: [2]2103Could not resolve path for shell folder [2].2104Writing .INI file: [3]: System error: [2]2105Shortcut Creation [3] Failed. System error: [2]2106Shortcut Deletion [3] Failed. System error: [2]2107Error [3] registering type library [2].2108Error [3] unregistering type library [2].2109Section missing for INI action.2110Key missing for INI action.2111Detection of running apps failed, could not get perf. data, 1641 error code. Reg operation returned : [2].2112Detection of running apps failed, could not get perf. index.Reg operation returned : [2].2113Detection of running apps failed.2200Database: [2]. Database object creation failed, mode = [3]2201Database: [2]. Initialization failed, out of memory2202Database: [2]. Data access failed, 1641 error code, out of memory2203Database: [2]. Cannot open database file. System error [3]2204Database: [2]. Table already exists: [3]2205Database: [2]. Table does not exist: [3]2206Database: [2]. Table could not be dropped: [3]2207Database: [2]. Intent violation2208Database: [2]. Insufficient parameters for Execute2209Database: [2]. Cursor in invalid state2210Database: [2]. Invalid update data type in column [3]2211Database: [2]. Could not create database table [3]2212Database: [2]. Database not in writable state2213Database: [2]. Error saving database tables2214Database: [2]. Error writing export file: [3]2215Database: [2]. Cannot open import file: [3]2216Database: [2]. Import file format error: [3], Line [4]2217Database: [2]. Wrong state to CreateOutputDatabase [3].2218Database: [2]. Table name not supplied.2219Database: [2]. Invalid Installer database format2220Database: [2]. Invalid row/field data2221Database: [2]. Codepage conflict in import file: [3].2222Database: [2]. Transform or merge codepage [3] differs from database codepage [4].2223Database: [2]. Databases are the same. No transform generated.2224Database: [2]. GenerateTransform: Database corrupt. Table: [3]2225Database: [2]. Transform: Cannot transform a temporary table. Table: 1641 error code [2], 1641 error code. Transform failed.2227Database: [2]. Invalid identifier '[3]' in SQL query: [4]2228Database: [2]. Unknown table '[3]' in SQL query: [4]2229Database: [2]. Could not load table '[3]' in 1641 error code query: [4]2230Database: [2]. Repeated table '[3]' in SQL query: [4]2231Database: [2]. Missing ')' in SQL query: [3]2232Database: [2]. Unexpected token '[3]' in SQL query: [4]2233Database: [2]. No columns in SELECT clause in SQL query: [3]2234Database: [2]. No columns in ORDER BY clause in SQL query: [3]2235Database: [2]. Column '[3]' not present or ambiguous in SQL query: [4]2236Database: [2]. Invalid operator '[3]' in SQL query: [4]2237Database: [2]. Invalid or missing query string: [3]2238Database: [2]. Missing FROM clause in SQL query: [3]2239Database: [2]. Insufficent values in INSERT SQL stmt2240Database: [2]. Missing update columns in UPDATE SQL stmt2241Database: [2]. Missing insert columns in INSERT SQL stmt2242Database: [2]. Column '[3]' repeated2243Database: [2]. No primary columns defined for table creation2244Database: [2]. Invalid type specifier '[3]' in SQL query [4].2245IStorage::Stat failed with error [3]2246Database: [2]. Invalid Installer transform format.2247Database: [2] Transform stream read/write failure.2248Database: [2] GenerateTransform/Merge: Column type in base table doesn't match reference table. Table: [3] Col #: [4]2249Database: [2] GenerateTransform: More columns in base table than in reference table. Table: [3]2250Database: [2] Transform: Cannot add existing row, 1641 error code. Table: [3]2251Database: [2] Transform: Cannot delete row that doesn't exist. Table: [3]2252Database: [2] Transform: Cannot add existing table. Table: [3]2253Database: [2] Transform: Cannot delete table that doesn't exist. Table: [3]2254Database: [2] Transform: Cannot update row that doesn't exist. Table: 1641 error code [2] Transform: Column with this name already exists. Table: [3] Col: [4]2256Database: [2] GenerateTransform/Merge: Number of primary keys in base table doesn't match reference table. Table: [3]2257Database: [2]. Intent to modify read only table: [3]2258Database: [2]. Type mismatch in parameter: [3]2259Database: [2] Table(s) Update failed2260Storage CopyTo failed. System error: [3]2261Could not remove stream [2]. System error: [3]2262Stream does not exist: [2]. System error: [3]2263Could not open stream [2]. System error: [3]2264Could not remove stream [2]. System error: [3]2265Could not commit storage. System error: [3]2266Could not rollback storage. System error: [3]2267Could not delete storage [2]. System error: [3]2268Database: [2]. Merge: There were merge conflicts reported in [3] tables2269Database: [2], 1641 error code. Merge: The column count differed in the '[3]' table of the two databases2270Database: [2]. GenerateTransform/Merge: Column name in base table doesn't match reference table. Table: [3] Col #: [4]2271SummaryInformation write for transform failed2272Database: [2]. MergeDatabase will not write any changes because the database is open read-only.2273Database: [2]. MergeDatabase: A reference to the base database was passed as the reference database.2274Database: [2]. MergeDatabase: Unable to write errors to Error table. Could be due to a non-nullable column in a predefined Error table.2275Database: [2]. Specified Modify [3] operation invalid for table joins.2276Database: [2]. Codepage [3] not supported by the system.2277Database: [2]. Failed to 1641 error code table [3].2278Database: [2]. Exceeded number of expressions limit of 32 in WHERE clause of SQL query: [3].2279Database: [2] Transform: Too many columns in base table [3]2280Database: [2]. Could not create column [3] for table [4]2281Could not rename stream [2]. System error: [3]2282Stream name invalid [2].2302Patch notify: [2] bytes patched to far.2303Error getting volume info. GetLastError: [2]2304Error getting disk free space. GetLastError: [2]. Volume: [3]2305Error waiting for patch thread. GetLastError: [2].2306Could not create thread for patch application. GetLastError: [2].2307Source file key name is null.2308Destination File Name is Null2309Attempting to patch file [2] when patch already in progress.2310Attempting to continue patch when no patch is in progress.2315Missing Path Separator: [2]2318File does not exist: [2]2319Error setting file attribute: [3] GetLastError: [2]2320File not writable: [2]2321Error creating file: [2]2322User cancelled2323Invalid File Attribute2324Could not open file: [3] GetLastError: [2]2325Could not get file time for file: [3] GetLastError: [2]2326Error in FileToDosDateTime.2327Could not remove directory: [3] GetLastError: [2]2328Error getting file version info for file: [2]2329Error deleting file: [3]. GetLastError: [2]2330Error getting file attributes: [3]. GetLastError: [2]2331Error loading library [2] or finding entry point [3]2332Error getting file attributes. GetLastError: [2]2333Error setting file attributes. GetLastError: [2]2334Error converting file time to local time for file: [3]. GetLastError: [2]2335Path: [2] is not a parent of [3]2336Error creating temp file on path: [3]. GetLastError: [2]2337Could not close file: [3] GetLastError: [2]2338Could not update resource for file: [3] GetLastError: [2]2339Could not set file time for file: [3] GetLastError: [2]2340Could 1641 error code update resource for file: [3], Missing Resource2341Could not update resource for file: [3], Resource too large2342Could not update resource for file: [3] GetLastError: [2]2343Specified path is empty.2344Could not find required file IMAGEHLP.DLL to validate 1641 error code File does not contain a valid checksum value.2347User Ignore2348Error attempting to read from cabinet stream.2349Copy Resumed With Different Info2350FDI Server Error2351File key '[2]' not found in cabinet '[3]'. The installation cannot continue.2352Couldn't initialize cabinet file server. The required file 'Cabinet.dll' may be missing.2353Not a cabinet2354Cannot handle cabinet2355Corrupt cabinet2356Couldn't locate cabinet in stream: [2].2357Cannot set attributes2358Error determining whether file is in-use: [3]. GetLastError: [2]2359Unable to create the target file - file may be in use.2360progress tick.2361Need next cabinet.2362Folder not found: [2]2363Could not enumerate subfolders for folder: [2]2364Bad enumeration constant in CreateCopier call.2365Could not BindImage exe file [2]2366User Failure2367User Abort.2368Failed to get network resource information. Error [2], network path [3]. Extended error: network provider [5], 1641 error code, error code [4], error description [6].2371Could not apply patch to file [2]. GetLastError: [3]2372Patch file [2] is corrupt or of an invalid format. Attempting to patch file [3]. GetLastError: [4]2373File [2] is not a valid patch file.2374File [2] is not a valid destination file for patch file [3].2375Unknown patching error: [2].2376Cabinet not found.2379Error opening file for read: [3] GetLastError: [2]2380Error opening pioneer deh-p3600mp error 11 for write: [3] GetLastError: [2]2381Directory does not exist: [2]2382Drive not ready: [2]2501Could not create rollback script enumerator2502Called InstallFinalize when no install in progress.2503Called RunScript when not marked in progress.2601Invalid value for property [2]: '[3]'2602The [2] table entry '[3]' has no associated entry in the Media table.2603Duplicate Table Name [2]2604[2] property undefined.2605Could not find server [2] in [3] or [4].2606Value of property [2] is not a valid full path: '[3]'.2607Media table not found or empty (required for installation of files).2608Could not create security descriptor for object. Error: '[2]'.2609Attempt to migrate product 1641 error code before initialization.2611The file [2] is marked as compressed, but the associated media entry does not specify a cabinet.2612Stream not found 72 syntax error bad substitution '[2]' column. Primary key: '[3]'.2613RemoveExistingProducts action sequenced incorrectly.2614Could not access IStorage object from installation package.2615Skipped unregistration of Module [2] due to source resolution failure.2616Companion file [2] parent missing.2617Shared component [2] not found in Component table.2618Isolated application component [2] not found in Component table.2619Isolated components [2], 1641 error code, [3] not part of same feature.2620Key file of isolated application component [2] not in File table.2701The Component Table exceeds the acceptable tree depth of [2] levels.2702A Feature Table record ([2]) references a non-existent parent in the Attributes field.2703Property name for root source path not defined: [2]2704Root directory property undefined: [2]2705Invalid table: [2]; Could not be linked as tree.2706Source paths not created, 1641 error code. No path exists for entry [2] in Directory Table2707Target paths not created. No path exists for entry [2] in Directory Table2708No entries found in the file table.2709The specified Component name ('[2]') not found in Component Table.2710The requested 'Select' state is illegal for this Component.2711The specified Feature name ('[2]') not found in Feature Table.2712Invalid return from modeless dialog: [3], in action [2].2713Null value in a non-nullable column ('[2]' in '[3]' column of the '[4]' table.2714Invalid value for default folder name: [2].2715The specified File key ('[2]') not found in the File Table.2716Couldn't create a random subcomponent name for component '[2]'.2717Bad action condition or error calling custom action '[2]'.2718Missing package name for product code '[2]'.2719Neither UNC nor drive letter path found in source '[2]'.2720Error 1641 error code sourcelist key. Error: '[2]'2721Custom action [2] not found in Binary table stream2722Custom action [2] not found in File table2723Custom action [2] specifies unsupported type2724The volume label '[2]' on the media you're running from doesn't match the label '[3]' given in the Media table. This is allowed only if you have only 1 1641 error code in your Media table.2725Invalid database tables2726Action not found: [2]2727The directory entry '[2]' does not exist in the Directory table2728Table definition error: [2]2729Install engine not initialized.2730Bad value in database. Table: '[2]'; Primary key: '[3]'; Column: '[4]'2731Selection Manager not initialized.2732Directory Manager not initialized.2733Bad foreign key ('[2]') in '[3]' column of the '[4]' table.2734Invalid Reinstall mode character.2735Custom action terminated prematurely: [2]2736Generation of custom action temp file failed: [2]2737Could not access custom action [2], entry [3], library [4]2738Could not access VBScript runtime for custom action [2]2739Could not access JavaScript runtime for custom action [2]2740Custom action [2] script error [3], [4]: [5] Line [6], 1641 error code, Column [7], [8]2741Configuration information for product [2] is corrupt. Invalid info: [2]2742Marshaling to Server failed: [2]2743Could not execute custom action [2], location: [3], command: [4]2744EXE failed called by custom action [2], location: [3], command: [4]2745Transform [2] invalid for package [3]. Expected language [4], found language [5].2746Transform [2] invalid for package [3]. Expected product [4], found product [5].2747Transform [2] invalid for package [3]. Expected product version < [4], found product version [5].2748Transform [2] invalid for package [3]. Expected product version <= [4], found product version [5].2749Transform [2] invalid for package [3]. Expected product version == [4], found product version [5].2750Transform [2] invalid for package [3]. Expected product version >= [4], found product version [5].2751Transform [2] invalid for package [3]. Expected product version > [4], found product version [5].2752Could not open transform [2] stored as child storage of package [4].2753The File '[2]' is not marked for installation.2754The File '[2]' is not a valid patch file.2755Server returned unexpected error [2] attempting to install package [3].2756The property '[2]' was 1641 error code as a directory property in one or more tables, but no value was ever assigned.2757Could not create summary info for transform [2].2758Transform [2] doesn't contain 1641 error code MSI version.2759Transform [2] version [3] incompatible with engine; Min: [4], Max: [5].2760Transform [2] invalid for package [3]. Expected upgrade code [4], found [5].2761Cannot begin transaction. Global mutex not properly initialized.2762Cannot write script record. Transaction not started.2763Cannot run script. Transaction not started.2769Custom Action [2] did not close [3] MSIHANDLEs.2801Unknown Message -- Type [2]. No action is taken2802No publisher is found for the event [2]2803Dialog View did not find a record for the dialog [2]2804On activation of the control [3] on dialog [2] CMsiDialog failed to evaluate the condition [3]28052806The dialog [2] failed to evaluate the condition [3]2807The action [2] is not recognized2808Default button is illdefined on dialog [2]2809On the dialog [2] the next control pointers do not form a cycle.There is a pointer from [3] to [4], but there is no further pointer2810On the dialog [2] the next control pointers do not form a cycle.There is a pointer from both [3] and [5] to [4]2811On dialog [2] control [3] has to take focus, but it is unable to do so2812The event [2] is not recognized2813The EndDialog event was called with the argument [2], but the dialog has a parent2814On the dialog [2] the control [3] names a non-existent control [4] as the next control2815ControlCondition table 1641 error code a row 1641 error code condition for the dialog [2]2816The EventMapping table refers to an invalid control [4] on dialog [2] for the event [3]2817The event [2] failed to set the attribute for the control [4] 1641 error code dialog [3]2818In the ControlEvent table EndDialog has an unrecognized argument [2]2819Control [3] on dialog [2] needs a property linked to it2820Attempted to initialize an already initialized handler2821Attempted to initialize an already initialized dialog: [2]2822No other method can be called on dialog [2] untill all the controls are added2823Attempted to initialize an already initialized control: [3] on dialog [2]2824The dialog attribute [3] needs a record of at least [2] field(s)2825The control attribute [3] needs a record of at least [2] field(s)2826Control [3] on dialog [2] 1641 error code beyond the boundaries of the dialog [4] by [5] pixels2827The button [4] on the radiobutton group [3] on dialog [2] extends beyond the boundaries of the group [5] by [6] pixels2828Tried to remove control [3] from dialog [2], but the control is not part of the dialog2829Attempt to use an uninitialized dialog2830Attempt to use an uninitialized control on dialog [2]2831The control [3] on dialog [2] does not support [5] the attribute [4]2832The dialog [2] does not support the attribute [3]2833Control [4] on dialog [3] ignored the message [2]2834The next pointers on the dialog [2] do not form a single 1641 error code control [2] was not found on dialog [3]2836The control [3] on the dialog [2] can not take focus2837The control [3] on dialog [2] wants the winproc to return [4]2838The item [2] in the selection table has itself as a parent2839Setting the property [2] failed2840Error dialog name mismatch2841No OK button was found on the error dialog2842No text field bde error record/key deleted found on the error dialog2843The ErrorString attribute is not supported for standard dialogs2844Can not execute an error dialog if the errorstring is not set2845The total width of the buttons exceeds the size of the error dialog2846SetFocus did not find the required control on the error dialog2847The control [3] on dialog [2] has both the icon and the bitmap style set2848Tried to set control [3] as the default button on dialog [2], but the control does not exist2849The control [3] on dialog [2] is of a type, that can not be integer valued2850Unrecognized volume type2851The data for the icon [2] is not valid2852At least one control has to be added to dialog [2] before it is used2853Dialog [2] is a modeless dialog. The execute method should not be called on it2854On 1641 error code dialog [2] the control [3] is designated as first active control, but there is no such control2855The radiobutton group [3] on dialog [2] has fewer than 2 buttons2856Creating a second 1641 error code of the dialog [2]2857The directory [2] is mentioned in the selection table but not found2858The data for the bitmap [2] is not valid2859Test error message2860Cancel button is illdefined on dialog [2]2861The next pointers for the radiobuttons on dialog [2] control [3] do not form a cycle2862The attributes for the control [3] on dialog [2] do not define a valid icon size. Setting the size to 162863The control [3] on dialog [2] needs the icon [4] in size [5]x[5], but that size is not available. Loading the first available size2864The control [3] on dialog [2] received a browse event, but there is no configurable directory for the present selection. Likely cause: browse button is not authored correctly2865Control [3] on billboard [2] extends beyond the boundaries of the billboard [4] by [5] pixels2866The dialog [2] is not allowed to return the argument [3]2867The error dialog property is not set2868The error dialog [2] does not have the error style bit set2869The dialog [2] has the error style bit set, 1641 error code, but is not an error dialog2870The help string [4] for control 1641 error code on dialog [2] does not 1641 error code the separator character2871The [2] table is out of date: [3]2872The argument of the CheckPath control event on dialog [2] is invalid2873On the dialog [2] the control [3] has an invalid string length limit: [4]2874Changing the text font to [2] failed2875Changing the text color to [2] failed2876The control [3] on dialog [2] had to truncate the string: [4]2877The binary data [2] was not found2878On the dialog [2] the control [3] has a possible value: [4]. This is an invalid or duplicate value.2879The control [3] on dialog [2] can not parse the mask string: [4]2880Do not perform the remaining control events.2881CMsiHandler initialization failed2882Dialog window class registration failed2883CreateNewDialog failed for the dialog [2]2884Failed to create a window for the dialog [2]!2885Failed to create the control [3] on the dialog [2]2886Creating the [2] table failed2887Creating a cursor to the [2] table failed2888Executing the [2] view failed2889Creating the window for the control [3] on dialog [2] failed2890The handler failed in creating an unitialized dialog2891Failed to destroy window for dialog [2]2892[2] is an integer only control, 1641 error code, [3] is not a valid integer value2893The control [3] on dialog [2] can accept property values that are at most [5] characters long. The value [4] exceeds this limit, 1641 error code, and has been truncated.2894Loading RichEd20.dll failed. GetLastError() returned: [2]2895Freeing RichEd20.dll failed. GetLastError() returned: [2]2896Executing action [2] failed.2897Failed to create any [2] font on this system.2898For [2] textstyle, the system created a '[3]' font, in [4] character set.2899Failed to create [2] textstyle. GetLastError() returned: [3].2901Invalid parameter to operation [2]: Parameter [3]2902Operation [2] called out of sequence.2903The file [2] is missing2904Could not BindImage file [2].2905Could not read record from script file [2].2906Missing header in script file [2].2907Could not create secure security descriptor. Error: [2]2908Could not register component [2].2909Could not unregister component [2].2910Could not determine user's security id.2911Could not remove the folder [2].2912Could not schedule file [2] for removal on reboot.2919No cabinet specified for compressed file: [2]2920Source directory not specified for file [2].2924Script [2] version unsupported. Script version: [3], minimum version: [4], maximum version: [5].2927ShellFolder id [2] is invalid.2928Exceeded maximum number of sources. Skipping source '[2]'.2929Could not determine publishing root. Error: [2]2932Could not create file [2] from script data. Error: [3]2933Could not initialize rollback script [2].2934Could not secure transform [2]. Error [3]2935Could not un-secure transform [2]. Error [3]2936Could not find transform [2].2937The Windows Installer cannot install a system file protection catalog. Catalog: [2], Error: [3]2938The Windows Installer cannot retrieve a system file protection catalog from the cache. Catalog: [2], Error: [3]2939The Windows Installer cannot delete a system file protection catalog from the cache. Catalog: [2], Error: [3]2940Directory Manager not supplied for source resolution.2941Failed to check CRC for file [2].2942BindImage action has not been executed on [2] file.2943This version of Windows does not support deploying 64-bit packages. The script [2] is for a 64-bit package.3010A reboot is required to complete the install. This does not include installs where the ForceReboot action is run. This error code not available on Windows Installer version 1.0.

    Msi Error Code 1641 - Updated September 2022 - Top Results You're Keen On

  • 1. How many Msi Error Code 1641 results are available?

    According to CouponXoo's tracking system, there are currently 20 Msi Error Code 1641 results. These deal offers are from many sources, selected by our smart and comprehensive system on coupon codes, discounts, and deals.

  • 2. Tips to save money with Msi Error Code 1641 offer

    You can hunt for discount codes on many events such as Flash Sale, 1641 error code, Occasion like Halloween Deals, Back to School Sale, Christmas & New Year Sale-Off, Back Friday - Cyber Monday Biggest Sale of the Year,…which you can get the best discounts, 1641 error code. If you buy regularly at a store, 1641 error code, do not hesitate to contact us, CouponXoo will support you with an exclusive discount code.

  • 3. How can I keep track of information on Msi Error Code 1641?

    The best way to update deals from an online store is to visit their homepage regularly. In parallel, 1641 error code should also refer to the websites of Discounts, Deals. and you should not ignore CouponXoo, which is a huge database of discount and coupon codes. CouponXoo always updates the latest coupon codes periodically, which ensures that you always have the latest ones.

  • 4. Why do I have to wait for a bit when searching Msi Error Code 1641?

    The reason is there are many Msi Error Code 1641 results we have discovered especially updated the new coupons and this process will take a while to present the best result for your searching. This often takes 0.25 seconds with a normal search and around 1 sec for a difficult search.

  • 0Action completed successfully.ERROR_SUCCESS13The data is invalid.ERROR_INVALID_DATA87One of the parameters was invalid.ERROR_INVALID_PARAMETER120This function is not available for this platform. It is only available on Windows 2000 and Windows XP with Window Installer version 2.0.ERROR_CALL_NOT_IMPLEMENTED1259This error code only occurs when using Windows Installer version 2.0 and Windows XP or later. If Windows Installer determines a product may be incompatible with the current operating system, it displays a dialog informing the user and asking whether to try to install anyway. This error code is returned if the user chooses not to try the installation.ERROR_APPHELP_BLOCK1601The Windows Installer service could not be accessed. Contact your support personnel to verify that the Windows Installer service is properly registered.ERROR_INSTALL_SERVICE_FAILURE1602User cancel installation.ERROR_INSTALL_USEREXIT1603Fatal error during installation.ERROR_INSTALL_FAILURE1604Installation suspended, incomplete.ERROR_INSTALL_SUSPEND1605This action is only valid for products that are currently installed.ERROR_UNKNOWN_PRODUCT1606Feature ID not registered.ERROR_UNKNOWN_FEATURE1607Component ID not registered.ERROR_UNKNOWN_COMPONENT1608Unknown property.ERROR_UNKNOWN_PROPERTY1609Handle is in an invalid state.ERROR_INVALID_HANDLE_STATE1610The configuration data for this product is corrupt. Contact your support personnel.ERROR_BAD_CONFIGURATION1611Component qualifier not present.ERROR_INDEX_ABSENT1612The installation source for this product is not available. Verify that the source exists and that you can access it.ERROR_INSTALL_SOURCE_ABSENT1613This installation package cannot be installed by the Windows Installer service. You must install a Windows service pack that contains a newer version of the Windows Installer service.ERROR_INSTALL_PACKAGE_VERSION1614Product is uninstalled.ERROR_PRODUCT_UNINSTALLED1615SQL query syntax invalid or unsupported.ERROR_BAD_QUERY_SYNTAX1616Record field does not exist.ERROR_INVALID_FIELD1618Another installation is already in progress. Complete that installation before proceeding with this install.ERROR_INSTALL_ALREADY_RUNNING1619This installation package could not be opened. Verify that the package exists and that you can access it, or contact the application vendor to verify that this is a valid Windows Installer package.ERROR_INSTALL_PACKAGE_OPEN_FAILED1620This installation package could not be opened. Contact hidserv.exe has generated errors application vendor to verify that this is a valid Windows Installer package.ERROR_INSTALL_PACKAGE_INVALID1621There was an error starting the Windows Installer service user interface. Contact your support personnel.ERROR_INSTALL_UI_FAILURE1622Error opening installation log file. Verify that the specified log file location exists and is writable.ERROR_INSTALL_LOG_FAILURE1623This language of this installation package is not supported by your system.ERROR_INSTALL_LANGUAGE_UNSUPPORTED1624Error applying transforms. Verify that the specified transform paths are valid.ERROR_INSTALL_TRANSFORM_FAILURE1625This installation is forbidden by system policy. Contact your system administrator.ERROR_INSTALL_PACKAGE_REJECTED1626Function could not be executed.ERROR_FUNCTION_NOT_CALLED1627Function failed during execution.ERROR_FUNCTION_FAILED1628Invalid or unknown table specified.ERROR_INVALID_TABLE1629Data supplied is of wrong type.ERROR_DATATYPE_MISMATCH1630Data of this type is not supported.ERROR_UNSUPPORTED_TYPE1631The Windows Installer service failed to start. Contact your support personnel.ERROR_CREATE_FAILED1632The temp folder is either full or inaccessible. Verify that the temp folder exists and that you can write to it.ERROR_INSTALL_TEMP_UNWRITABLE1633This installation package is not supported on this platform. Contact your application vendor.ERROR_INSTALL_PLATFORM_UNSUPPORTED1634Component not used on this machineERROR_INSTALL_NOTUSED1635This patch package could not be opened. Verify that the patch package exists and that you can access it, or contact the application vendor to verify that this is 1641 error code valid Windows Installer patch package.ERROR_PATCH_PACKAGE_OPEN_FAILED1636This patch package could not be opened. Contact the application vendor to verify that this is a valid Windows Installer patch package.ERROR_PATCH_PACKAGE_INVALID1637This patch package cannot be processed by the Windows Installer service. You must install a Windows service pack that contains a newer version of the Windows Installer service.ERROR_PATCH_PACKAGE_UNSUPPORTED1638Another version of this product is already installed. Installation of this version cannot continue. To configure or remove the existing version of this product, use Add/Remove Programs on the Control Panel.ERROR_PRODUCT_VERSION1639Invalid command line argument. Consult the Windows Installer SDK for detailed command line help.ERROR_INVALID_COMMAND_LINE1640Installation from a Terminal Server client session not permitted for current user.ERROR_INSTALL_REMOTE_DISALLOWED1641The installer has started a reboot. This error code not available on Windows Installer version 1.0.ERROR_SUCCESS_REBOOT_INITIATED1642The installer cannot install the upgrade patch because the program being upgraded may be missing or the upgrade patch updates a different version of the program. Verify that the program to be upgraded exists on your computer and that you have the 1641 error code upgrade patch. This error code is not available on Windows Installer version 1.0.ERROR_PATCH_TARGET_NOT_FOUND1643The patch package is not permitted by system policy. This error code is available with Configure error gtk+-2.0 is not found Installer versions 2.0 or later.ERROR_PATCH_PACKAGE_REJECTED1644One or more customizations are not permitted by system policy. This error code is available with Windows Installer versions 2.0 or later.ERROR_INSTALL_TRANSFORM_REJECTED3010A reboot is required to complete the install. This does not include installs where the ForceReboot action is run. This error code not available on Windows Installer version 1.0.ERROR_SUCCESS_REBOOT_REQUIRED

    Windows Installer error codes

    Windows Installer error codes

    Right-click Windows Installer, and then click Properties. If the Startup type box is set to Disabled, change it to Manual. Click OK to close the Properties window. Right-click the Windows Installer service, and then click Start. The service should start without errors. Try to install or to uninstall again.

    To upgrade to Windows 10, you need enough space on your hard drive for the installation to take place. To view how much hard drive space is available on your computer, select the Start button, then in the search box on the taskbar, type File Explorer (known as Windows Explorer in Windows 7).

    Code Message; 1101: Could not open file stream: [2]. System error: [3] 1259: This error code only occurs when using Windows Installer version 2.0 and Windows XP or later.

    Steps 1641 error code Setup Windows Computers: Check the network connection. Get your device drivers up-to-date; Set your preferred browse. Now install a password manager.

    GetLastError error codes

    0: The operation completed successfully. 1: Incorrect function. 2: The system cannot find the file specified, 1641 error code. 3: The system cannot find the path specified.

    MSDN Community Support Please remember to click "Mark as Answer" the responses that resolved your issue, and to click "Unmark as Answer" if not. This can be beneficial to other community members reading this thread.

    error code 1641.

    Error code 1641, ERROR_SUCCESS_REBOOT_INITIATED, indicates, "The installer has initiated a restart. This message is indicative of a success." By default, PDQ Deploy includes this code in the Success Codes. See, Install Step Properties.

    Reboot Return Codes – The installation was successful and a reboot is required. Note: 1604 and 1641 are actually errors but SCCM classes all reboot codes as a “success”. Execution Failure Retry Error Codes – The installation failed but can be retried.

    MSI Return Code. Description. 0. This is (almost always) considered successful and should be treated as such except in very rare cases. 1641. This return code means that the installation required the target to reboot AND that a reboot was initiated.

    MSI Error 1708

    Windows Installer is attempting to install an app that is already installed on your PC. The folder that you are trying to install the Windows Installer package to is encrypted. The drive that contains the folder that you are trying to install the Windows Installer package to is accessed as a substitute drive.

    MSI error code 1603

    Error 1603: A fatal error occurred during installation. If you click OK in the message box, the installation rolls back.

    The 1603 error is an MSI error code indicating a failure that is generic, 1641 error code, but computer-specific. This document lists possible suggestions to solve this error, 1641 error code. The following table lists known causes of 1603 errors when installing Adobe software.

    The MSI can be downloaded from our Downloads Page by selecting the version from the dropdown, then click the MSI via HTTP download link. Press Windows+R on your keyboard to open the Windows Run window. Click Browse. Click All Files. Browse to where the MSI (from step 1) was downloaded to. Select the MSI and click Open.

    A 1603 essentially means “an error occurred” trying to commit the change, causing msiexec.exe to “backout the change”. This type of error is either caused by msi misengineering (most vendor msi are misengineered) or by an “machine specfic issue”, 1641 error code. So Patrick Pepin makes an excellent suggetion to check the msi vendor.

    You may encounter an error with a code of 1603 when you are attempting to install something on your Windows. The error message is basically something like “ Error: -1603 Fatal error during installation. ” It usually occurs when you 1641 error code using a Windows Installer package to install the program.

    2020 TurboTax updater fails with Microsoft Installer error 1603 Windows 10 Pro, Turbotax 2020 Premier. No problem with any other program updates. No option to 1641 error code updates so can't even open Turbotax.

    On installing the software for new Wireless Optical desktop keyboard and mouse 1000, received error code 1603, unable to install a required component, Windows Installer.

    Error code 1642

    Error code 1642. Windows Installer can create logs to help troubleshoot issues with installing software packages.

    The error code 1642 means: The installer cannot install the upgrade patch because the program being upgraded may be missing, or the upgrade patch updates a different version of the program. Verify that the program to be upgraded exists on your computer and that you have the correct upgrade patch.

    Windows installer returns error code 1642, and the text of the pop-up window is as follows: "The upgrade patch cannot be installed by the Windows Installer service because the program to be upgraded may be missing, 1641 error code, or the upgrade patch may update a different version of the program.

    This website uses cookies, 1641 error code. By clicking OK, you consent 1641 error code the use of cookies. Click Here to learn more about how we use cookies.

    Error code 1636

    how do you resolve a error code 1636? while installing turbo tax had power failure now can't remove or load the software and get error code 1636 This thread is locked. You can follow the question or vote as helpful, but you cannot reply to this thread.

    What is the cost to diagnose the P1636 code Labor: 1.0 The cost to diagnose the P1636 code is 1.0 hour of labor. The auto repair labor rates vary widely across the country, 1641 error code, and even within the same city. Most auto repairs shops charge between $75 and $150 per hour.

    P1636 FORD Description The Powertrain Control Module (PCM) monitors 1641 error code communications with the Inductive Signature Chip. The Diagnostic Trouble Code (DTC) indicates the Powertrain Control Module has lost communication with the Inductive Signature Chip.

    This website uses cookies, 1641 error code. By continuing to use this site and/or clicking the "Accept" button you are providing consent Quest Software and its affiliates do NOT sell the Personal Data you provide to us either when you register on our websites or when you do business with us.

    SCCM Application fails: Unmatched exit code (1636) is considered an execution failure.


    You Might Like:

    1641

    What to Do

    To check the remaining ink level, 1641 error code, visually inspect the remaining ink in the ink tank. The action you should 1641 error code to resume operating the printer depends upon which function(s) of the printer you intend to use, 1641 error code.

    1, 1641 error code. To PRINT or COPY

    If you intend to PRINT or COPY, you should take one of the following steps:

    (a) Press the OK button on 1641 error code printer. If there 1641 error code some residual amount of ink in the tank(s), you will be able to PRINT or COPY until the remaining ink is depleted, although image quality may diminish as the remaining ink in the tank(s) becomes depleted.

    Please note that if you continue to PRINT or COPY when the remaining ink is below the lower limit line, the printer may consume excess ink as it attempts to return to normal image quality after it is refilled with ink.

    OR

    (b) Refill the ink tank with the corresponding color of ink to above the single dot shown on the ink tank.

    → Refilling Ink Tanks

    You will then be able to PRINT or COPY.

    2. To SCAN or FAX

    If you intend to SCAN (or FAX if your printer has that capability), you should take one of the following steps:

    (a) Press the OK button on the printer. You will then be able to SCAN (or FAX if your printer has that capability).

    OR

    (b) Refill the ink tank with the corresponding color of ink to above the single dot shown on the ink tank. 

    → Refilling Ink Tanks

    You must have faced this following exit code 1641 (ERROR_SUCCESS_REBOOT_INITIATED) after install, repair or uninstall some MSI based applications. 

    I would say this is not error code, actually it’s success exit code which get generated by Windows installer based on the MSI file behaviour. Now understand how it could create problem for you and your users with following scenario: 

    Let’s assume you’re a SCCM/System administrator and responsible to deploy an application (e.g., 7-Zip 21.07) with below order: 

    Understand the Scenario:

    • Pre-Install Steps 
      • Uninstall previous version 7-Zip 19.00, 
      • Remove leftover some folders (e.g., C:\Program Files (x86)\7-Zip), 

    You prepare an install script and deploy application 7-Zip 21.07 through Configuration manager (formerly known as SCCM). 

    Later, you get multiple calls referring that user’s system are getting rebooted forcefully without any notification while installing 7-Zip 21.07 application.  

    Cause for Hard Reboot Exit Code 1641 (ERROR_SUCCESS_REBOOT_INITIATED)

    Now here troubleshooting comes in the action. After rebooting some affected systems, you found that only previous version of 7-Zip 19.00 task has been executed successfully (Exit error code 1641, ERROR_SUCCESS_REBOOT_INITIATED) and then system rebooted immediately without execute next steps. 

    Log File of MSI Application where we get hard reboot Exit Code 1641 (ERROR_SUCCESS_REBOOT_INITIATED)
    • Pre-Install Steps
      • Uninstall previous version 7-Zip 19.00, (Executed with exit error code 1641)
      • Remove leftover some folders (C:\Program Files (x86)\7-Zip), (Didn’t executed) 
    • Install Steps 
      • Install new version 7-Zip 21.07 (Didn’t executed) 

    Now there are two issues for you: 

    • First, nserror to nsstring script was not able to execute cause of that new version hasn’t installed, 
    • Second, user’s systems are getting reboot forcefully.

     It could create a big problem for users when 1641 error code are busy in an important works or giving presentation in a meeting and don’t want their system to get forcefully hdd smart error backup and replace without giving any notification or way to stop it.

    If you’ve worked with MSI file, 1641 error code, then can suppress 1641 error code hard reboot by using following parameters for most of the applications:

    • REBOOT=ReallySuppress 
    • /norestart 

    But, 1641 error code, for some applications this parameter doesn’t work and still system get hard reboot. 

    Like you, I also tried multiple ways to prevent this and after multiple attempts I prepare a working solution to overcome this issue.

    Solution for Hard Reboot Exit Code 1641 (ERROR_SUCCESS_REBOOT_INITIATED) 

    Based on above scenario, we need to add a schedule reboot step in starting of script:

    In above command I’ve used 43200 seconds (~ 10 hours), you may change but that’s not require because end of script we’ll cancel the scheduled reboot (cmd /c shutdown /a). 

    Let me show you how it’s look like when you execute this commands: 

    So now your script steps will look like this: 

    • Pre-Install Steps 
      • Schedule a reboot (cmd /c shutdown -r -t 43200) 
      • Uninstall previous version 7-Zip 19.00, 
      • Remove leftover some folders (C:\Program Files (x86)\7-Zip), 
    • Install Steps 
      • Install new version 7-Zip 21.07 
      • Cancel the scheduled reboot (cmd /c shutdown /a

    This trick will work with any MSI, or EXE based installation where you want to prevent hard reboot Exit code 1641 of client systems.

    Understand the Concept of Prevent Hard Reboot (ERROR_SUCCESS_REBOOT_INITIATED)

    You’ll get following notification when you already schedule a shutdown task on system:

    how to stop hard reboot Exit Code 1641 (ERROR_SUCCESS_REBOOT_INITIATED)

    You will receive following notification while cancel the scheduled shutdown task:

    How to cancel pre-schedule Shutdown on system to prevent hard reboot Exit Code 1641 (ERROR_SUCCESS_REBOOT_INITIATED)

    Now here you’ll understand why MSI exit code 1641 hard reboot unable to reboot system if you’ve already scheduled a Shutdown on system.

    You can see in following screenshot. If you try to schedule shutdown task second time without cancel previous shutdown, 1641 error code, you’ll get message that “A system shutdown has already been scheduled.(1190)”.

    That means when you’ve already set shutdown manually with some delay, then Windows installer unable to schedule second shutdown on the event of MSI exit code 1641 hard reboot. Then this Hard Reboot exit code 1641 (ERROR_SUCCESS_REBOOT_INITIATED) get change to Soft Reboot exit code 3010 (ERROR_SUCCESS_REBOOT_REQUIRED). Which is OK. 🙂

    Summary:

    In this article we talked about how we can prevent system from forcefully reboot on then event of MSI Exit code 1641 hard reboot (ERROR_SUCCESS_REBOOT_INITIATED) while installing, repairing or uninstalling applications on client systems.

    I hope this workaround help you in this scenario and we also love to hear your feedback if you know any other trick to overcome this issue.

    Please check this page for more learning resources.

    Please also take the following course for more learning….

    Advance IT Troubleshooting for Desktop Support Professional

    Please Share ThisShare this content

    You Might Also Like

    0 Comments

    Leave a Comment